1,4,6-Tricarbomethoxynaphthalene
- Formula: C16H14O6
- Molecular weight: 302.2788
- IUPAC Standard InChIKey: CEDUMKANAJFFGA-UHFFFAOYSA-N
- CAS Registry Number: 36063-05-5
- Chemical structure:
View 3d structure (requires JavaScript / HTML 5) - Permanent link for this species. Use this link for bookmarking this species for future reference.

Phase change data

Data compiled by: William E. Acree, Jr., James S. Chickos
Enthalpy of fusion
ΔfusH (kJ/mol) | Temperature (K) | Method | Reference |
---|---|---|---|
30.2 | 409.2 | DSC | Acree, 1993 |

References

Acree, 1993
Acree, William E.,
Thermodynamic properties of organic compounds,
Thermochimica Acta, 1993, 219, 97-104, https://doi.org/10.1016/0040-6031(93)80486-T
. [all data]