6-(tert-butyl)-1,1-dimethylindan
- Formula: C15H22
- Molecular weight: 202.3352
- IUPAC Standard InChIKey: ZGPWHILODVHWKJ-UHFFFAOYSA-N
- CAS Registry Number: 3605-31-0
- Chemical structure:
View 3d structure (requires JavaScript / HTML 5) - Other names: 1H-Indene, 6-(1,1-dimethylethyl)-2,3-dihydro-1,1-dimethyl-

Gas phase thermochemistry data

Data compiled as indicated in comments:
ALS - Hussein Y. Afeefy, Joel F. Liebman, and Stephen E. Stein
Quantity | Value | Units | Method | Reference | Comment |
---|---|---|---|---|---|
ΔfH°gas | -104. | kJ/mol | Semi | Stewart, 2004 | |
ΔfH°gas | -174.3 ± 2.6 | kJ/mol | Ccb | Good, 1971 | ALS |

Condensed phase thermochemistry data

Data compiled by: Hussein Y. Afeefy, Joel F. Liebman, and Stephen E. Stein
Quantity | Value | Units | Method | Reference | Comment |
---|---|---|---|---|---|
ΔcH°liquid | -8872.2 ± 2.4 | kJ/mol | Ccb | Good, 1971 | Corresponding ΔfHºliquid = -174. kJ/mol (simple calculation by NIST; no Washburn corrections) |

References

Stewart, 2004
Stewart, J.J.P.,
Comparison of the accuracy of semiempirical and some DFT methods for predicting heats of formation,
J. Mol. Model, 2004, 10, 1, 6-10, https://doi.org/10.1007/s00894-003-0157-6
. [all data]
Good, 1971
Good, W.D.,
The enthalpies of combustion and formation of indan and seven alkylindans,
J. Chem. Thermodyn., 1971, 3, 711-717. [all data]