Phenol, 2,5-bis(1-methylethyl)-
- Formula: C12H18O
- Molecular weight: 178.2707
- IUPAC Standard InChIKey: VFNUNYPYULIJSN-UHFFFAOYSA-N
- CAS Registry Number: 35946-91-9
- Chemical structure:
View 3d structure (requires JavaScript / HTML 5) - Other names: 2,5-Diisopropylphenol; p-Diisopropylbenzene monoalc.

Gas phase thermochemistry data

Data compiled by: Hussein Y. Afeefy, Joel F. Liebman, and Stephen E. Stein
Quantity | Value | Units | Method | Reference | Comment |
---|---|---|---|---|---|
ΔfH°gas | -254.1 ± 2.8 | kJ/mol | Eqk | Nesterova, Pimerzin, et al., 1989 | Author was aware that data differs from previously reported values; Isomerization |
ΔfH°gas | -241. | kJ/mol | Ccb | Bertholon, Giray, et al., 1971 |

Condensed phase thermochemistry data

Data compiled by: Hussein Y. Afeefy, Joel F. Liebman, and Stephen E. Stein
Quantity | Value | Units | Method | Reference | Comment |
---|---|---|---|---|---|
ΔfH°liquid | -330. | kJ/mol | Ccb | Bertholon, Giray, et al., 1971 | |
Quantity | Value | Units | Method | Reference | Comment |
ΔcH°liquid | -6966. | kJ/mol | Ccb | Bertholon, Giray, et al., 1971 | Corresponding ΔfHºliquid = -330. kJ/mol (simple calculation by NIST; no Washburn corrections) |

Phase change data

Data compiled as indicated in comments:
ALS - Hussein Y. Afeefy, Joel F. Liebman, and Stephen E. Stein
DRB - Donald R. Burgess, Jr.
Quantity | Value | Units | Method | Reference | Comment |
---|---|---|---|---|---|
ΔvapH° | 86.11 | kJ/mol | C | Bertholon, Giray, et al., 1971 | ALS |
ΔvapH° | 89.0 | kJ/mol | N/A | Bertholon, Giray, et al., 1971 | DRB |

Reaction thermochemistry data

Data compiled by: Hussein Y. Afeefy, Joel F. Liebman, and Stephen E. Stein
Individual Reactions
By formula: C12H18O = C12H18O
Quantity | Value | Units | Method | Reference | Comment |
---|---|---|---|---|---|
ΔrH° | -9.20 ± 0.63 | kJ/mol | Eqk | Nesterova, Pilyshchikov, et al., 1983 | liquid phase; GC |
By formula: C12H18O = C12H18O
Quantity | Value | Units | Method | Reference | Comment |
---|---|---|---|---|---|
ΔrH° | -1.26 ± 0.08 | kJ/mol | Eqk | Nesterova, Pilyshchikov, et al., 1983 | liquid phase; GC |

References

Nesterova, Pimerzin, et al., 1989
Nesterova, T.N.; Pimerzin, A.A.; Rozhnov, A.M.; Karlina, T.N.,
Equilibria for the isomerization of (secondary-alkyl)phenols and cyclohexylphenols,
J. Chem. Thermodyn., 1989, 21, 385-395. [all data]
Bertholon, Giray, et al., 1971
Bertholon, G.; Giray, M.; Perrin, R.; Vincent-Falquet-Berny, M.F.,
No. 532. - Etude physicochimique des phenols. OX. - Ethanlpies de combustion et energies de resonance des alcoyl et aryphenols,
Bull. Soc. Chim. France, 1971, 3180-3187. [all data]
Nesterova, Pilyshchikov, et al., 1983
Nesterova, T.N.; Pilyshchikov, V.A.; Rozhnov, A.M.,
Chemical Equilibrium in the system isopropylphenols-phenol,
J. Appl. Chem. USSR, 1983, 56, 1257-1261. [all data]