3,3,3-Trifluoro-1,2-epoxypropane
- Formula: C3H3F3O
- Molecular weight: 112.0505
- IUPAC Standard InChIKey: AQZRARFZZMGLHL-UHFFFAOYSA-N
- CAS Registry Number: 359-41-1
- Chemical structure:
View 3d structure (requires JavaScript / HTML 5) - Other names: Oxirane, trifluoromethyl; Oxirane, 2-(trifluoromethyl)-; 1,1,1-Trifluoro-2,3-epoxypropane

Normal alkane RI, non-polar column, temperature ramp

Column type | Active phase | I | Reference | Comment |
---|---|---|---|---|
Capillary | OV-101 | 508. | Zenkevich, 2005 | 25. m/0.20 mm/0.10 μm, N2/He, 6. K/min; Tstart: 50. C; Tend: 250. C |

References

Zenkevich, 2005
Zenkevich, I.G.,
Experimentally measured retention indices., 2005. [all data]