Difluoroacetamide
- Formula: C2H3F2NO
- Molecular weight: 95.0481
- IUPAC Standard InChIKey: ZMIBIIAWFMCVFD-UHFFFAOYSA-N
- CAS Registry Number: 359-38-6
- Chemical structure:
View 3d structure (requires JavaScript / HTML 5) - Permanent link for this species. Use this link for bookmarking this species for future reference.

Condensed phase thermochemistry data

Data compiled by: Hussein Y. Afeefy, Joel F. Liebman, and Stephen E. Stein
Quantity | Value | Units | Method | Reference | Comment |
---|---|---|---|---|---|
ΔfH°solid | -699.98 | kJ/mol | Ccb | Swarts, 1909 | crystal phase |
Quantity | Value | Units | Method | Reference | Comment |
ΔcH°solid | -872.07 | kJ/mol | Ccb | Swarts, 1919 | Not corrected for CODATA value of ΔfH |
ΔcH°solid | -868.64 | kJ/mol | Ccb | Swarts, 1909 | crystal phase |

References

Swarts, 1909
Swarts, M.F.,
Sur la chaleur de formation de quelquesuns compounds organiques fluords,
Recl. Trav. Chim. Pays-Bas, 1909, 28, 143-154. [all data]
Swarts, 1919
Swarts, F.,
Etudes thermochimiques sur les combinaisons organiques fluorees,
J. Chim. Phys., 1919, 17, 3-70. [all data]