Ethane, 1,1,2,2-tetrafluoro-
- Formula: C2H2F4
- Molecular weight: 102.0309
- IUPAC Standard InChIKey: WXGNWUVNYMJENI-UHFFFAOYSA-N
- CAS Registry Number: 359-35-3
- Chemical structure:
View 3d structure (requires JavaScript / HTML 5) - Other names: Freon 134; R 134; 1,1,2,2-Tetrafluoroethane; CHF2CHF2

Normal alkane RI, non-polar column, temperature ramp

Column type | Active phase | I | Reference | Comment |
---|---|---|---|---|
Capillary | Polydimethyl siloxane: CP-Sil 5 CB | 248. | Bramston-Cook, 2013 | 60. m/0.25 mm/1.0 μm, Helium, 45. C @ 1.45 min, 3.6 K/min, 210. C @ 2.72 min |

Phase change data

Data compiled as indicated in comments:
BS - Robert L. Brown and Stephen E. Stein
TRC - Thermodynamics Research Center, NIST Boulder Laboratories, Chris Muzny director

Quantity Value Units Method Reference Comment
Tboil250.KN/APCR Inc., 1990BS
Tboil250.15KN/AEiseman, 1959Uncertainty assigned by TRC = 0.5 K; TRC
Tboil250.KN/AYoung, Fukuhara, et al., 1940Uncertainty assigned by TRC = 3. K; TRC
Tboil250.KN/AHenne and Renoll, 1936Uncertainty assigned by TRC = 4. K; TRC
Quantity Value Units Method Reference Comment
Tc391.74KN/ATatoh, Kuwabara, et al., 1993Uncertainty assigned by TRC = 0.05 K; ITS-90; TRC
Tc391.8KN/AChae, Schmidt, et al., 1990Uncertainty assigned by TRC = 0.5 K; by extrapolation to equality of L and G refr. index; TRC
Quantity Value Units Method Reference Comment
ρc5.25mol/lN/ATatoh, Kuwabara, et al., 1993Uncertainty assigned by TRC = 0.03 mol/l; TRC
ρc5.24mol/lN/AChae, Schmidt, et al., 1990Uncertainty assigned by TRC = 0.08 mol/l; derived from obs L and G refractive index; TRC

In addition to the Thermodynamics Research Center (TRC) data available from this site, much more physical and chemical property data is available from the following TRC products:

References

Bramston-Cook, 2013
Bramston-Cook, R.,
Kovats indices for C2-C13 hydrocarbons and selected oxygenated/halocarbons with 100 % dimethylpolysiloxane columns, 2013, retrieved from http://lotusinstruments.com/monographs/List .... [all data]