Ethene, trichlorofluoro-
- Formula: C2Cl3F
- Molecular weight: 149.379
- IUPAC Standard InChIKey: LFMIQNJMJJKICW-UHFFFAOYSA-N
- CAS Registry Number: 359-29-5
- Chemical structure:
View 3d structure (requires JavaScript / HTML 5) - Other names: Ethylene, trichlorofluoro-; Trichlorofluoroethylene; CFCl=CCl2; Ethylene, fluorotrichloro-

Phase change data

Data compiled by: Robert L. Brown and Stephen E. Stein
Quantity | Value | Units | Method | Reference | Comment |
---|---|---|---|---|---|
Tboil | 344. | K | N/A | PCR Inc., 1990 | |
Tboil | 344.2 | K | N/A | Weast and Grasselli, 1989 |

References

PCR Inc., 1990
PCR Inc.,
Research Chemicals Catalog 1990-1991, PCR Inc., Gainesville, FL, 1990, 1. [all data]
Weast and Grasselli, 1989
CRC Handbook of Data on Organic Compounds, 2nd Editon, Weast,R.C and Grasselli, J.G., ed(s)., CRC Press, Inc., Boca Raton, FL, 1989, 1. [all data]
Lacher and Park, 1950
Lacher, J.R.; Park, J.D.,
J. Am. Chem. Soc., 1950, 72, 5486. [all data]