Butane, 2-fluoro-
- Formula: C4H9F
- Molecular weight: 76.1127
- IUPAC Standard InChIKey: IXHWZHXLJJPXIS-UHFFFAOYSA-N
- CAS Registry Number: 359-01-3
- Chemical structure:
View 3d structure (requires JavaScript / HTML 5) - Other names: 2-Fluorobutane

Phase change data

Data compiled by: William E. Acree, Jr., James S. Chickos
Enthalpy of vaporization
ΔvapH (kJ/mol) | Temperature (K) | Method | Reference | Comment |
---|---|---|---|---|
29.2 | 248. | A | Stephenson and Malanowski, 1987 | Based on data from 233. to 329. K. See also Dykyj, 1971. |

Normal alkane RI, non-polar column, temperature ramp

Column type | Active phase | I | Reference | Comment |
---|---|---|---|---|
Capillary | OV-101 | 469. | Zenkevich, 2005 | 25. m/0.20 mm/0.10 μm, N2/He, 6. K/min; Tstart: 50. C; Tend: 250. C |

References

Stephenson and Malanowski, 1987
Stephenson, Richard M.; Malanowski, Stanislaw,
Handbook of the Thermodynamics of Organic Compounds, 1987, https://doi.org/10.1007/978-94-009-3173-2
. [all data]
Dykyj, 1971
Dykyj, J.,
Petrochemia, 1971, 11, 2, 27. [all data]
Zenkevich, 2005
Zenkevich, I.G.,
Experimentally measured retention indices., 2005. [all data]