3H-Pyrido(3,4-b)indole, 4,9-dihydro-6-methoxy-1-methyl-
- Formula: C13H14N2O
- Molecular weight: 214.2631
- IUPAC Standard InChIKey: HMBHRMFLDKKSCT-UHFFFAOYSA-N
- CAS Registry Number: 3589-73-9
- Chemical structure:
View 3d structure (requires JavaScript / HTML 5) - Other names: 6-Methoxy-1-methyl-4,9-dihydro-3H-pyrido(3,4-b)indole; 6-Methoxyharmalan; 6-Methoxy-1-methyl-3,4-dihydro-β-carboline; 6-Methoxyharmalane; 3H-Pyrido(3,4-b)indole, 4,9-dihydro-6-methoxy-1-methyl-, monohydrochloride; 6-Methoxy-1-methyl-4,9-dihydro-3H-pyrido(3,4-b)indole monohydrochloride

Van Den Dool and Kratz RI, non-polar column, custom temperature program

Column type | Active phase | I | Reference | Comment |
---|---|---|---|---|
Capillary | VF-5MS | 2242.7 | Tret'yakov, 2008 | 30. m/0.25 mm/0.25 μm, He; Program: Multi-step temperature program; T(initial)=60C; T(final)=270C |

References

Tret'yakov, 2008
Tret'yakov, K.V.,
Retention Data. NIST Mass Spectrometry Data Center., NIST Mass Spectrometry Data Center, 2008. [all data]