8-Pentyltheophylline
- Formula: C12H18N4O2
- Molecular weight: 250.2969
- IUPAC Standard InChIKey: CTISWFWBZUSEFT-UHFFFAOYSA-N
- CAS Registry Number: 35873-41-7
- Chemical structure:
View 3d structure (requires JavaScript / HTML 5) - Permanent link for this species. Use this link for bookmarking this species for future reference.

Phase change data

Data compiled as indicated in comments:
TRC - Thermodynamics Research Center, NIST Boulder Laboratories, Chris Muzny director
AC - William E. Acree, Jr., James S. Chickos
Quantity | Value | Units | Method | Reference | Comment |
---|---|---|---|---|---|
Tfus | 498.3 | K | N/A | Gondova, Kralik, et al., 1989 | Uncertainty assigned by TRC = 0.3 K; TRC |
Enthalpy of fusion
ΔfusH (kcal/mol) | Temperature (K) | Reference | Comment |
---|---|---|---|
8.39 | 498.4 | Acree, 1991 | AC |

References

Gondova, Kralik, et al., 1989
Gondova, T.; Kralik, P.; Gonda, J.,
Determination of some thermodynamic characteristics of melting of 8-alkyltheophyllines by the DSC method,
Thermochim. Acta, 1989, 156, 1, 147, https://doi.org/10.1016/0040-6031(89)87180-1
. [all data]
Acree, 1991
Acree, William E.,
Thermodynamic properties of organic compounds: enthalpy of fusion and melting point temperature compilation,
Thermochimica Acta, 1991, 189, 1, 37-56, https://doi.org/10.1016/0040-6031(91)87098-H
. [all data]