2,4,4,7-tetramethyloctane

Phase change data

Data compiled by: Thermodynamics Research Center, NIST Boulder Laboratories, Chris Muzny director

Quantity Value Units Method Reference Comment
Tboil457.KN/APetrov, Sushchinskii, et al., 1957Uncertainty assigned by TRC = 3. K

In addition to the Thermodynamics Research Center (TRC) data available from this site, much more physical and chemical property data is available from the following TRC products:

References

Petrov, Sushchinskii, et al., 1957
Petrov, A.D.; Sushchinskii, V.L.; Zakharov, E.P.; Rogozhnikova, T.I., Synthesis of Branched ALiphatic C10-C15 Hydrocarbons by the Grignard and the Grignard-Wurtz Reactions, Zh. Obshch. Khim., 1957, 27, 467. [all data]