Benzene, 1-methyl-3-phenoxy-
- Formula: C13H12O
- Molecular weight: 184.2338
- IUPAC Standard InChIKey: UDONPJKEOAWFGI-UHFFFAOYSA-N
- CAS Registry Number: 3586-14-9
- Chemical structure:
View 3d structure (requires JavaScript / HTML 5) - Other names: Ether, phenyl m-tolyl; m-Methylphenyl phenyl ether; m-Phenoxytoluene; Phenyl m-tolyl ether; 1-Methyl-3-phenoxybenzene; 3-Methylphenyl phenyl ether; 3-Phenoxytoluene; 3-Methyldiphenyl ether; Phenyl 3-tolyl ether; Diphenyl ether, 3-methyl

Phase change data

Data compiled by: Robert L. Brown and Stephen E. Stein
Quantity | Value | Units | Method | Reference | Comment |
---|---|---|---|---|---|
Tboil | 545.2 | K | N/A | Weast and Grasselli, 1989 | |
Tboil | 544. to 546. | K | N/A | Frinton Laboratories Inc., 1986 |

Lee's RI, non-polar column, temperature ramp

Column type | Active phase | I | Reference | Comment |
---|---|---|---|---|
Capillary | HP-5 | 259.0 | Wang, Hou, et al., 2007 | 30. m/0.30 mm/0.25 μm, Helium, 50. C @ 5. min, 5. K/min, 200. C @ 15. min |

References

Weast and Grasselli, 1989
CRC Handbook of Data on Organic Compounds, 2nd Editon, Weast,R.C and Grasselli, J.G., ed(s)., CRC Press, Inc., Boca Raton, FL, 1989, 1. [all data]
Frinton Laboratories Inc., 1986
Frinton Laboratories Inc.,
Catalog Number 11, Frinton Laboratories Inc., Vineland, NJ, 1986, 99. [all data]
Wang, Hou, et al., 2007
Wang, G.; Hou, Z.; Sun, Y.; Liu, Y.; Xie, B.; Liu, S.,
Investigation of pyrolysis behavior of fenoxycarb using PY-GC-MS assisted with chemometric methods,
Chem. Anal., 2007, 52, 141-156. [all data]