Benzenamine, 3-phenoxy-
- Formula: C12H11NO
- Molecular weight: 185.2218
- IUPAC Standard InChIKey: UCSYVYFGMFODMY-UHFFFAOYSA-N
- CAS Registry Number: 3586-12-7
- Chemical structure:
View 3d structure (requires JavaScript / HTML 5) - Other names: m-Phenoxyaniline; 3-Aminodiphenyl ether; m-Aminophenyl phenyl ether; Aniline, m-phenoxy-; 3-Phenoxyaniline

Phase change data

Data compiled by: Robert L. Brown and Stephen E. Stein
Quantity | Value | Units | Method | Reference | Comment |
---|---|---|---|---|---|
Tboil | 602.7 | K | N/A | Aldrich Chemical Company Inc., 1990 | |
Tboil | 588.2 | K | N/A | Weast and Grasselli, 1989 | |
Tboil | 588. | K | N/A | Buckingham and Donaghy, 1982 | |
Quantity | Value | Units | Method | Reference | Comment |
Tfus | 310. | K | N/A | Buckingham and Donaghy, 1982 |
Reduced pressure boiling point
Tboil (K) | Pressure (bar) | Reference |
---|---|---|
423. to 426. | 0.004 | Buckingham and Donaghy, 1982 |

References

Aldrich Chemical Company Inc., 1990
Aldrich Chemical Company Inc.,
Catalog Handbook of Fine Chemicals, Aldrich Chemical Company, Inc., Milwaukee WI, 1990, 1. [all data]
Weast and Grasselli, 1989
CRC Handbook of Data on Organic Compounds, 2nd Editon, Weast,R.C and Grasselli, J.G., ed(s)., CRC Press, Inc., Boca Raton, FL, 1989, 1. [all data]
Buckingham and Donaghy, 1982
Buckingham, J.; Donaghy, S.M.,
Dictionary of Organic Compounds: Fifth Edition, Chapman and Hall, New York, 1982, 1. [all data]