Tetrasul sulfoxide
- Formula: C12H6Cl4OS
- Molecular weight: 340.052
- IUPAC Standard InChIKey: IEPUYXNXNXZXRP-UHFFFAOYSA-N
- CAS Registry Number: 35850-29-4
- Chemical structure:
View 3d structure (requires JavaScript / HTML 5) - Other names: Benzene, 1,2,4-trichloro-5-[(4-chlorophenyl)sulfinyl]-; p-Chlorophenyl 2,4,5-trichlorophenyl sulfoxide; V 110

Phase change data

Data compiled by: Thermodynamics Research Center, NIST Boulder Laboratories, Chris Muzny director
Quantity | Value | Units | Method | Reference | Comment |
---|---|---|---|---|---|
Tfus | 415.5 | K | N/A | Plato, 1972 | Uncertainty assigned by TRC = 0.2 K |

References

Plato, 1972
Plato, C.,
DSC as a general method for determining purity and heat of fusion of high-purity organic chemicals,
Anal. Chem., 1972, 44, 1531. [all data]