Thiazole, 5-methyl-
- Formula: C4H5NS
- Molecular weight: 99.154
- IUPAC Standard InChIKey: RLYUNPNLXMSXAX-UHFFFAOYSA-N
- CAS Registry Number: 3581-89-3
- Chemical structure:
View 3d structure (requires JavaScript / HTML 5) - Other names: 5-Methylthiazole

Phase change data

Data compiled as indicated in comments:
BS - Robert L. Brown and Stephen E. Stein
TRC - Thermodynamics Research Center, NIST Boulder Laboratories, Chris Muzny director
AC - William E. Acree, Jr., James S. Chickos
Quantity | Value | Units | Method | Reference | Comment |
---|---|---|---|---|---|
Tfus | 232.74 | K | N/A | Meyer and Metzger, 1966 | Uncertainty assigned by TRC = 0.05 K; TRC |
Reduced pressure boiling point
Tboil (K) | Pressure (bar) | Reference | Comment |
---|---|---|---|
414.7 | 0.993 | Aldrich Chemical Company Inc., 1990 | BS |
Enthalpy of fusion
ΔfusH (kJ/mol) | Temperature (K) | Reference | Comment |
---|---|---|---|
7.65 | 232.8 | Meyer and Metzger, 1966 | AC |

Kovats' RI, non-polar column, isothermal

Data compiled by: NIST Mass Spectrometry Data Center, William E. Wallace, director

Column type CapillaryCapillaryPacked
Active phase OV-101OV-101Apiezon L
Column length (m) 50.50.2.5
Carrier gas HeHe
Substrate   Chromosorb GAW
Column diameter (mm) 0.30.30
Phase thickness (μm) 0.40.40
Temperature (C) 110.110.100.
I 865.865.840.
ReferenceZhuravleva, 2000Zhuravleva, Shenderyuk, et al., 1990Yakush, Golovnya, et al., 1986
Comment MSDC-RI MSDC-RI MSDC-RI

Van Den Dool and Kratz RI, polar column, temperature ramp

Data compiled by: NIST Mass Spectrometry Data Center, William E. Wallace, director

Column type Capillary
Active phase DB-Wax
Column length (m) 60.
Carrier gas He
Substrate
Column diameter (mm) 0.25
Phase thickness (μm) 0.25
Tstart (C) 40.
Tend (C) 200.
Heat rate (K/min) 2.
Initial hold (min) 5.
Final hold (min) 30.
I 1318.
ReferenceKim, 2001
Comment MSDC-RI

References

Meyer and Metzger, 1966
Meyer, R.; Metzger, J.,
C. R. Acad. Sci. Paris, Ser. C, 1966, 263, 1333. [all data]
Aldrich Chemical Company Inc., 1990
Aldrich Chemical Company Inc.,
Catalog Handbook of Fine Chemicals, Aldrich Chemical Company, Inc., Milwaukee WI, 1990, 1. [all data]