n-Nonylmalonic acid
- Formula: C12H22O4
- Molecular weight: 230.3007
- IUPAC Standard InChIKey: FWQNYUYRXNWOOM-UHFFFAOYSA-N
- CAS Registry Number: 3578-47-0
- Chemical structure:
View 3d structure (requires JavaScript / HTML 5) - Permanent link for this species. Use this link for bookmarking this species for future reference.

Condensed phase thermochemistry data

Data compiled by: Hussein Y. Afeefy, Joel F. Liebman, and Stephen E. Stein
Quantity | Value | Units | Method | Reference | Comment |
---|---|---|---|---|---|
ΔcH°solid | -1608.5 ± 1.3 | kcal/mol | Ccb | Verkade and Coops, 1933 | At 288 °K; Corresponding ΔfHºsolid = -271.6 kcal/mol (simple calculation by NIST; no Washburn corrections) |

References

Verkade and Coops, 1933
Verkade, P.E.; Coops, J., Jr.,
Alternation phenomena VI (calorimetric researches XX): alternations in the properties of n.monoalkylmalonic acids. Some remarks on malkins views concerning the alternation phenonema,
Recl. Trav. Chim. Pays-Bas, 1933, 52, 747-767. [all data]