Benzene, (1-bromo-1-methylethyl)-
- Formula: C9H11Br
- Molecular weight: 199.088
- IUPAC Standard InChIKey: WSFSJXBURLJOFD-UHFFFAOYSA-N
- CAS Registry Number: 3575-19-7
- Chemical structure:
View 3d structure (requires JavaScript / HTML 5) - Species with the same structure:

Phase change data

Data compiled by: William E. Acree, Jr., James S. Chickos
Quantity | Value | Units | Method | Reference | Comment |
---|---|---|---|---|---|
ΔvapH° | 58.0 | kJ/mol | CGC | Krasnykh, Vasiltsova, et al., 2002 |

Reaction thermochemistry data

Data compiled by: Hussein Y. Afeefy, Joel F. Liebman, and Stephen E. Stein
Individual Reactions
By formula: HBr + C9H10 = C9H11Br
Quantity | Value | Units | Method | Reference | Comment |
---|---|---|---|---|---|
ΔrH° | -63.6 ± 5.4 | kJ/mol | Cm | Nesterova, Kovzel, et al., 1977 | liquid phase; Hydrobromination |

References

Krasnykh, Vasiltsova, et al., 2002
Krasnykh, Eugen L.; Vasiltsova, Tatiana V.; Verevkin, Sergey P.; Heintz, Andreas,
Vapor Pressures and Enthalpies of Vaporization of Benzyl Halides and Benzyl Ethers,
J. Chem. Eng. Data, 2002, 47, 6, 1372-1378, https://doi.org/10.1021/je020034h
. [all data]
Nesterova, Kovzel, et al., 1977
Nesterova, T.N.; Kovzel, E.N.; Karaseva, S.Ya.; Rozhnov, A.M.,
Heats of reaction of the hydrohalogenation of styrene and α-methylstyrene,
Vses. Konf. Kalorim. Rasshir. Tezisy Dokl. 7th, 1977, 1, 132. [all data]