CAS Reg. No. 35730-33-7

Reaction thermochemistry data

Data compiled by: John E. Bartmess

Individual Reactions

(CAS Reg. No. 35730-33-7 • 42949672952-Butanone) + 2-Butanone = CAS Reg. No. 35730-33-7

By formula: (CAS Reg. No. 35730-33-7 • 4294967295C4H8O) + C4H8O = CAS Reg. No. 35730-33-7

Quantity Value Units Method Reference Comment
Δr164. ± 9.2kJ/molN/ATaft, 1987gas phase; value altered from reference due to change in acidity scale

References

Taft, 1987
Taft, R.W., The Nature and Analysis of Substitutent Electronic Effects, Personal communication. See also Prog. Phys. Org. Chem., 1987, 16, 1. [all data]