1-Butene, 1,1,2,3,3,4,4,4-octafluoro-
- Formula: C4F8
- Molecular weight: 200.0300
- IUPAC Standard InChIKey: ZVJOQYFQSQJDDX-UHFFFAOYSA-N
- CAS Registry Number: 357-26-6
- Chemical structure:
View 3d structure (requires JavaScript / HTML 5) - Species with the same structure:
- Other names: Perfluoro-1-butene

Phase change data

Data compiled as indicated in comments:
BS - Robert L. Brown and Stephen E. Stein
TRC - Thermodynamics Research Center, NIST Boulder Laboratories, Chris Muzny director
AC - William E. Acree, Jr., James S. Chickos
Quantity | Value | Units | Method | Reference | Comment |
---|---|---|---|---|---|
Tboil | 278.0 | K | N/A | Weast and Grasselli, 1989 | BS |
Tboil | 274. | K | N/A | Lazerte, Hals, et al., 1953 | Uncertainty assigned by TRC = 2. K; TRC |
Enthalpy of vaporization
ΔvapH (kJ/mol) | Temperature (K) | Method | Reference | Comment |
---|---|---|---|---|
28.9 | 264. | A | Stephenson and Malanowski, 1987 | Based on data from 203. to 279. K. See also Dykyj, 1971.; AC |

Reaction thermochemistry data

Data compiled by: Hussein Y. Afeefy, Joel F. Liebman, and Stephen E. Stein
Individual Reactions
By formula: C4F8 + Cl2 = C4Cl2F8
Quantity | Value | Units | Method | Reference | Comment |
---|---|---|---|---|---|
ΔrH° | -188.2 ± 1.3 | kJ/mol | Cm | Lacher, Kianpour, et al., 1957 | gas phase |

References

Weast and Grasselli, 1989
CRC Handbook of Data on Organic Compounds, 2nd Editon, Weast,R.C and Grasselli, J.G., ed(s)., CRC Press, Inc., Boca Raton, FL, 1989, 1. [all data]
Lazerte, Hals, et al., 1953
Lazerte, J.D.; Hals, L.J.; Ried, T.S.; Smith, G.H.,
Pyrolyses of the Salts of the Perfluoro Carboxylic Acids,
J. Am. Chem. Soc., 1953, 75, 4525. [all data]
Stephenson and Malanowski, 1987
Stephenson, Richard M.; Malanowski, Stanislaw,
Handbook of the Thermodynamics of Organic Compounds, 1987, https://doi.org/10.1007/978-94-009-3173-2
. [all data]
Dykyj, 1971
Dykyj, J.,
Petrochemia, 1971, 11, 2, 27. [all data]
Lacher, Kianpour, et al., 1957
Lacher, J.R.; Kianpour, A.; Park, J.D.,
Reaction heats of organic halogen compounds. X. Vapor phase heats of hydrobromination of cyclopropane and propylene,
J. Phys. Chem., 1957, 61, 1124-1125. [all data]