1,1'-Biphenyl, 2,2',5,5'-tetrachloro-

Phase change data

Data compiled by: William E. Acree, Jr., James S. Chickos

Enthalpy of vaporization

ΔvapH (kJ/mol) Temperature (K) Method Reference Comment
80.8368.GCFalconer and Bidleman, 1994Based on data from 343. - 398. K.
79.398.GCHinckley, Bidleman, et al., 1990Based on data from 343. - 453. K.

Enthalpy of sublimation

ΔsubH (kJ/mol) Temperature (K) Method Reference Comment
102.0 ± 0.5338.MENakajoh, Shibata, et al., 2005Based on data from 323. - 353. K.
94.6308.GSWestcott, Simon, et al., 1981Based on data from 303. - 312. K.

References

Falconer and Bidleman, 1994
Falconer, Renee L.; Bidleman, Terry F., Vapor pressures and predicted particle/gas distributions of polychlorinated biphenyl congeners as functions of temperature and ortho-chlorine substitution, Atmospheric Environment, 1994, 28, 3, 547-554, https://doi.org/10.1016/1352-2310(94)90130-9 . [all data]

Hinckley, Bidleman, et al., 1990
Hinckley, Daniel A.; Bidleman, Terry F.; Foreman, William T.; Tuschall, Jack R., Determination of vapor pressures for nonpolar and semipolar organic compounds from gas chromatograhic retention data, J. Chem. Eng. Data, 1990, 35, 3, 232-237, https://doi.org/10.1021/je00061a003 . [all data]

Nakajoh, Shibata, et al., 2005
Nakajoh, Katsuhiko; Shibata, Etsuro; Todoroki, Tomohiro; Ohara, Atsushi; Nishizawa, Katsushi; Nakamura, Takashi, VAPOR PRESSURE OF TEN POLYCHLORINATED BIPHENYL CONGENERS AND TWO COMMERCIAL FLUIDS AS A FUNCTION OF TEMPERATURE, Environ Toxicol Chem, 2005, 24, 7, 1602, https://doi.org/10.1897/04-381R.1 . [all data]

Westcott, Simon, et al., 1981
Westcott, John W.; Simon, Charles G.; Bidleman, Terry F., Determination of polychlorinated biphenyl vapor pressures by a semimicro gas saturation method, Environ. Sci. Technol., 1981, 15, 11, 1375-1378, https://doi.org/10.1021/es00093a012 . [all data]