1,1'-Biphenyl, 2,4,6-trichloro-
- Formula: C12H7Cl3
- Molecular weight: 257.543
- IUPAC Standard InChIKey: MTLMVEWEYZFYTH-UHFFFAOYSA-N
- CAS Registry Number: 35693-92-6
- Chemical structure:
View 3d structure (requires JavaScript / HTML 5) - Other names: 2,4,6-Trichloro-1,1'-biphenyl; 2,4,6-Trichlorobiphenyl; PCB 30

Phase change data

Data compiled as indicated in comments:
TRC - Thermodynamics Research Center, NIST Boulder Laboratories, Chris Muzny director
AC - William E. Acree, Jr., James S. Chickos
Quantity | Value | Units | Method | Reference | Comment |
---|---|---|---|---|---|
Tfus | 334.3 | K | N/A | Miller, Ghodbane, et al., 1984 | Uncertainty assigned by TRC = 0.2 K; TRC |
Enthalpy of vaporization
ΔvapH (kcal/mol) | Temperature (K) | Method | Reference | Comment |
---|---|---|---|---|
17.8 | 368. | GC | Falconer and Bidleman, 1994 | Based on data from 343. to 393. K.; AC |
Enthalpy of fusion
ΔfusH (kcal/mol) | Temperature (K) | Reference | Comment |
---|---|---|---|
3.94 | 334.3 | Acree, 1991 | AC |

Normal alkane RI, non-polar column, temperature ramp

Column type | Active phase | I | Reference | Comment |
---|---|---|---|---|
Capillary | HP-5 | 1737. | Zenkevich, Moeder, et al., 2004 | 30. m/0.25 mm/0.25 μm, Helium, 50. C @ 3. min, 3. K/min, 280. C @ 20. min |

Henry's Law data

Data compiled by: Rolf Sander
Henry's Law constant (water solution)
kH(T) = k°H exp(d(ln(kH))/d(1/T) ((1/T) - 1/(298.15 K)))
k°H = Henry's law constant for solubility in water at 298.15 K (mol/(kg*bar))
d(ln(kH))/d(1/T) = Temperature dependence constant (K)
k°H (mol/(kg*bar)) | d(ln(kH))/d(1/T) (K) | Method | Reference | Comment |
---|---|---|---|---|
1.5 | M | Dunnivant, Coates, et al., 1988 | ||
2.7 | X | Burkhard, Armstrong, et al., 1985 | Value given here as quoted by Dunnivant, Coates, et al., 1988. | |
140. | 5000. | X | N/A |

References

Miller, Ghodbane, et al., 1984
Miller, M.M.; Ghodbane, S.; Wasik, S.P.; Tewari, Y.B.; Martire, D.E.,
Aqueous Solubilities, Octanol/Water Partition Coefficients, and Entropies of Melting of Chlorinated Benzenes and Biphenyls,
J. Chem. Eng. Data, 1984, 29, 184-190. [all data]
Falconer and Bidleman, 1994
Falconer, Renee L.; Bidleman, Terry F.,
Vapor pressures and predicted particle/gas distributions of polychlorinated biphenyl congeners as functions of temperature and ortho-chlorine substitution,
Atmospheric Environment, 1994, 28, 3, 547-554, https://doi.org/10.1016/1352-2310(94)90130-9
. [all data]
Acree, 1991
Acree, William E.,
Thermodynamic properties of organic compounds: enthalpy of fusion and melting point temperature compilation,
Thermochimica Acta, 1991, 189, 1, 37-56, https://doi.org/10.1016/0040-6031(91)87098-H
. [all data]
Zenkevich, Moeder, et al., 2004
Zenkevich, I.G.; Moeder, M.; Koeller, G.; Schrader, S.,
Using new structurally related additive schemes in the precalculation of gas chromatographic retention indices of polychlorinated hydroxybiphenyls on HP-5 stationary phase,
J. Chromatogr. A, 2004, 1025, 2, 227-236, https://doi.org/10.1016/j.chroma.2003.10.106
. [all data]