Nonacarbonylcobaltmanganese

Phase change data

Data compiled by: William E. Acree, Jr., James S. Chickos

Quantity Value Units Method Reference Comment
Δsub72. ± 2.kJ/molCAddison, Connor, et al., 1998

Enthalpy of sublimation

ΔsubH (kJ/mol) Temperature (K) Method Reference
85. ± 2.308.CAddison, Connor, et al., 1998

References

Addison, Connor, et al., 1998
Addison, Susan J.; Connor, Joseph A.; Kinkaid, John A., High temperature microcalorimetric studies of the thermal decomposition and halogenation of nonacarbonylcobaltmanganese, nonacarbonylcobaltrhenium and decacarbonylmanganeserhenium, Journal of Organometallic Chemistry, 1998, 554, 2, 123-127, https://doi.org/10.1016/S0022-328X(97)00663-3 . [all data]