Pentafluoropropionic anhydride
- Formula: C6F10O3
- Molecular weight: 310.0464
- IUPAC Standard InChIKey: XETRHNFRKCNWAJ-UHFFFAOYSA-N
- CAS Registry Number: 356-42-3
- Chemical structure:
View 3d structure (requires JavaScript / HTML 5) - Other names: Perfluoropropionic anhydride; Propanoic acid, pentafluoro-, anhydride; Pentafluoropropionic acid anhydride; Perfluoropropionic acid anhydride; Propionic acid, pentafluoro-, anhydride; 2,2,3,3,3-Pentafluoropropionic acid anhydride; Pentafluoropropanoic anhydride

Phase change data

Data compiled by: Robert L. Brown and Stephen E. Stein
Quantity | Value | Units | Method | Reference | Comment |
---|---|---|---|---|---|
Tboil | 347. | K | N/A | PCR Inc., 1990 |
Reduced pressure boiling point
Tboil (K) | Pressure (bar) | Reference |
---|---|---|
342. to 343. | 0.980 | Farchan Laboratories, 1990 |

Normal alkane RI, non-polar column, temperature ramp

Column type | Active phase | I | Reference | Comment |
---|---|---|---|---|
Capillary | OV-101 | 606. | Zenkevich and Rodin, 2002 | Nitrogen, 60. C @ 0. min, 4. K/min, 240. C @ 0. min; Column length: 25. m; Column diameter: 0.25 mm |

Normal alkane RI, non-polar column, custom temperature program

Column type | Active phase | I | Reference | Comment |
---|---|---|---|---|
Capillary | Polydimethyl siloxanes | 606. | Zenkevich, 2001 | Program: not specified |

References

PCR Inc., 1990
PCR Inc.,
Research Chemicals Catalog 1990-1991, PCR Inc., Gainesville, FL, 1990, 1. [all data]
Farchan Laboratories, 1990
Farchan Laboratories,
Research Chemicals Catalog, Farchan Laboratories, Gainesville, FL, 1990, 91. [all data]
Chamberlain and Whittle, 1972
Chamberlain, G.A.; Whittle, E.,
J. Chem. Soc., Faraday Trans. 1, 1972, 96. [all data]
Zenkevich and Rodin, 2002
Zenkevich, I.G.; Rodin, A.A.,
Gas Chromatographic One-Step Determination of Number of Hydroxyl Groups in Polyphenols with Mixed Derivatization Reagents,
Zh. Anal. Khim. (Rus.), 2002, 57, 7, 732-736. [all data]
Zenkevich, 2001
Zenkevich, I.G.,
Encyclopedia of Chromatography. Derivatization of Amines, Amino Acids, Amides and Imides for GC Analysis, Marcel Dekker, Inc, New York - Basel, 2001, 224. [all data]