Sesquimustard
- Formula: C6H12Cl2S2
- Molecular weight: 219.195
- IUPAC Standard InChIKey: AMGNHZVUZWILSB-UHFFFAOYSA-N
- CAS Registry Number: 3563-36-8
- Chemical structure:
View 3d structure (requires JavaScript / HTML 5) - Other names: 1,2-Bis(2-chloroethylthio)ethane; Ethane, 1,2-bis(2-chloro-ethylthio)-; Ethane, 1,2-bis((2-chloroethyl)mercapto)-; HSM 1; Sesqui-mustard Q; Sesquisulfur Mustard; SM 1; SSM; TL 86; Bis(2-chloroethylthio)ethane; 1,2-Bis(β-chloroethylthio)ethane; 1,8-Dichloro-3,6-dithiaoctane; 3,6-Dithia-1,8-octanedichloride; Agent Q; NSC 30025

Van Den Dool and Kratz RI, non-polar column, temperature ramp

Column type | Active phase | I | Reference | Comment |
---|---|---|---|---|
Capillary | SE-54 | 1703.3 | Kostiainen, 2000 | 25. m/0.32 mm/0.25 μm, He, 40. C @ 1. min, 10. K/min, 280. C @ 10. min |
Capillary | SE-54 | 1689.48 | Kaipainen, Kostiainen, et al., 1992 | 25. m/0.32 mm/0.25 μm, He, 40. C @ 1. min, 10. K/min; Tend: 280. C |
Capillary | SE-54 | 1690.10 | Kaipainen, Kostiainen, et al., 1992 | 25. m/0.32 mm/0.25 μm, He, 40. C @ 1. min, 10. K/min; Tend: 280. C |
Capillary | DB-5 | 1694. | Hancock and Peters, 1991 | He, 50. C @ 2. min, 10. K/min; Column length: 15. m; Column diameter: 0.53 mm |
Capillary | DB-5 | 1688.8 | D'agostino and Provost, 1988 | 15. m/0.32 mm/0.25 μm, 50. C @ 2. min, 10. K/min, 300. C @ 5. min |
Capillary | DB-5 | 1688.8 | D'Agostino and Provost, 1985 | 15. m/0.32 mm/0.25 μm, He, 50. C @ 2. min, 10. K/min; Tend: 300. C |
Capillary | DB-5 | 1688.2 | D'Agostino and Provost, 1985 | 15. m/0.32 mm/0.25 μm, He, 50. C @ 2. min, 10. K/min, 300. C @ 5. min |

Van Den Dool and Kratz RI, polar column, temperature ramp

Column type | Active phase | I | Reference | Comment |
---|---|---|---|---|
Capillary | DB-Wax | 2619.9 | D'Agostino and Provost, 1985 | 15. m/0.32 mm/0.25 μm, He, 50. C @ 2. min, 10. K/min, 250. C @ 5. min |

Normal alkane RI, non-polar column, temperature ramp

Column type | Active phase | I | Reference | Comment |
---|---|---|---|---|
Capillary | DB-5 | 1684. | Hanaoka, Nomura, et al., 2006 | 30. m/0.32 mm/0.25 μm, He, 100. C @ 5. min, 10. K/min; Tend: 280. C |
Capillary | DB-5 | 1687. | Hanaoka, Nomura, et al., 2006 | 30. m/0.32 mm/0.25 μm, He, 100. C @ 5. min, 10. K/min; Tend: 280. C |

Normal alkane RI, non-polar column, custom temperature program

Column type | Active phase | I | Reference | Comment |
---|---|---|---|---|
Capillary | 5 % Phenyl methyl siloxane | 1703. | OPCW, 1997 | Program: not specified |

References

Kostiainen, 2000
Kostiainen, O.,
Gas Chromatography in Screening of Chemicals Related to the Chemical Weapons Convention
in Encyclopedia of Analytical Chemistry, Meyers, R.A., ed(s)., John Wiley Sons Ltd, Chichester, 2000, 963-979. [all data]
Kaipainen, Kostiainen, et al., 1992
Kaipainen, A.; Kostiainen, O.; Riekkola, M.-L.,
Identification of chemical warfare agents in air samples using capillary column gas chromatography with three simultaneous detectors,
J. Microcolumn Sep., 1992, 4, 3, 245-251, https://doi.org/10.1002/mcs.1220040311
. [all data]
Hancock and Peters, 1991
Hancock, J.R.; Peters, G.R.,
Retention index monitoring of compounds of chemical defence interest using thermal desorption gas chromatography,
J. Chromatogr., 1991, 538, 2, 249-257, https://doi.org/10.1016/S0021-9673(01)88845-2
. [all data]
D'agostino and Provost, 1988
D'agostino, P.A.; Provost, L.R.,
Gas chromatographic retention indices of sulphur vesicants and related compounds,
J. Chromatogr., 1988, 436, 399-411, https://doi.org/10.1016/S0021-9673(00)94599-0
. [all data]
D'Agostino and Provost, 1985
D'Agostino, P.A.; Provost, L.R.,
Gas chromatographic retention indices of chemical warfare agents and simulants,
J. Chromatogr., 1985, 331, 47-54, https://doi.org/10.1016/0021-9673(85)80005-4
. [all data]
Hanaoka, Nomura, et al., 2006
Hanaoka, S.; Nomura, K.; Wada, T.,
Determination of mustard and lewisite related compounds in abandoned chemical weapons (Yellow shells) from sources in China and Japan,
J. Chromatogr. A, 2006, 1101, 1-2, 268-277, https://doi.org/10.1016/j.chroma.2005.10.028
. [all data]
OPCW, 1997
OPCW,
Conference of the States Parties C-I/DEC.64 (22 May 1997), 1997, retrieved from http://www.opcw.org/html/global/cseries/csp1/CIDEC64.html. [all data]