Butanoic acid, heptafluoro-, methyl ester
- Formula: C5H3F7O2
- Molecular weight: 228.0649
- IUPAC Standard InChIKey: MRPUVAKBXDBGJQ-UHFFFAOYSA-N
- CAS Registry Number: 356-24-1
- Chemical structure:
View 3d structure (requires JavaScript / HTML 5) - Other names: Butyric acid, heptafluoro-, methyl ester; Heptafluorobutyric acid methyl ester; Methyl heptafluorobutyrate; Methyl perfluorobutyrate; Methyl heptafluorobutanoate; Heptafluorobutanoic acid, methyl ester; 2,2,3,3,4,4,4-Heptafluoro-butyric acid methyl ester

Phase change data

Data compiled as indicated in comments:
BS - Robert L. Brown and Stephen E. Stein
TRC - Thermodynamics Research Center, NIST Boulder Laboratories, Chris Muzny director
AC - William E. Acree, Jr., James S. Chickos
Quantity | Value | Units | Method | Reference | Comment |
---|---|---|---|---|---|
Tboil | 353. | K | N/A | PCR Inc., 1990 | BS |
Tboil | 353.2 | K | N/A | Weast and Grasselli, 1989 | BS |
Quantity | Value | Units | Method | Reference | Comment |
Tfus | 191.4 | K | N/A | Golovanova and Kolesov, 1984 | Uncertainty assigned by TRC = 0.2 K; TRC |
Enthalpy of fusion
ΔfusH (kJ/mol) | Temperature (K) | Reference | Comment |
---|---|---|---|
11.77 | 191.4 | Domalski and Hearing, 1996 | AC |

Kovats' RI, non-polar column, isothermal

Column type | Active phase | Temperature (C) | I | Reference | Comment |
---|---|---|---|---|---|
Capillary | OV-101 | 100. | 483. | Promyshlennikova, Kirichenko, et al., 1992 | |
Capillary | OV-101 | 100. | 482.6 | Promyshlennikova, Kirichenko, et al., 1991 | He; Column length: 50. m; Column diameter: 0.25 mm |

References

PCR Inc., 1990
PCR Inc.,
Research Chemicals Catalog 1990-1991, PCR Inc., Gainesville, FL, 1990, 1. [all data]
Weast and Grasselli, 1989
CRC Handbook of Data on Organic Compounds, 2nd Editon, Weast,R.C and Grasselli, J.G., ed(s)., CRC Press, Inc., Boca Raton, FL, 1989, 1. [all data]
Golovanova and Kolesov, 1984
Golovanova, Y.G.; Kolesov, V.P.,
Enthalpies of melting, melting temperatures, and cryoscopic constants of some haloorganic compounds,
Vestn. Mosk. Univ., Ser. 2: Khim., 1984, 25, 244. [all data]
Domalski and Hearing, 1996
Domalski, Eugene S.; Hearing, Elizabeth D.,
Heat Capacities and Entropies of Organic Compounds in the Condensed Phase. Volume III,
J. Phys. Chem. Ref. Data, 1996, 25, 1, 1, https://doi.org/10.1063/1.555985
. [all data]
Promyshlennikova, Kirichenko, et al., 1992
Promyshlennikova, E.P.; Kirichenko, V.E.; Pashkevich, K.I.; Grigor'eva, D.N.; Golovnya, R.V.,
Influence of the stationary phase nature on the retention of polyfluorinated carboxylic acid esters,
Zh. Anal. Khim., 1992, 47, 1070-1075. [all data]
Promyshlennikova, Kirichenko, et al., 1991
Promyshlennikova, E.P.; Kirichenko, V.E.; Pashkevich, K.I.; Grigor'eva, D.N.; Golovnya, R.V.,
Capillary chromatography of polyfluorinated carboxylic esters,
Izv. Akad. Nauk SSSR Ser. Khim., 1991, 8, 1541-1545. [all data]