Cyclobutane, 1,2-dichloro-1,2,3,3,4,4-hexafluoro-
- Formula: C4Cl2F6
- Molecular weight: 232.939
- IUPAC Standard InChIKey: LMHAGAHDHRQIMB-UHFFFAOYSA-N
- CAS Registry Number: 356-18-3
- Chemical structure:
View 3d structure (requires JavaScript / HTML 5) - Other names: Cyclobutane, 1,2-dichlorohexafluoro-; 1,2-Dichlorohexafluorocyclobutane; 1,2-Dichloroperfluorocyclobutane; 1,2-Dichloro-1,2,3,3,4,4-hexafluorocyclobutane

Phase change data

Data compiled by: Robert L. Brown and Stephen E. Stein
Quantity | Value | Units | Method | Reference | Comment |
---|---|---|---|---|---|
Tboil | 332. to 333. | K | N/A | PCR Inc., 1990 | |
Tboil | 332.7 | K | N/A | Weast and Grasselli, 1989 |

Reaction thermochemistry data

Data compiled by: Hussein Y. Afeefy, Joel F. Liebman, and Stephen E. Stein
Individual Reactions
By formula: C4F6 + Cl2 = C4Cl2F6
Quantity | Value | Units | Method | Reference | Comment |
---|---|---|---|---|---|
ΔrH° | -156.4 ± 4.1 | kJ/mol | Cm | Lacher, McKinley, et al., 1949 | gas phase; Heat of chlorination at 363 °K |

References

PCR Inc., 1990
PCR Inc.,
Research Chemicals Catalog 1990-1991, PCR Inc., Gainesville, FL, 1990, 1. [all data]
Weast and Grasselli, 1989
CRC Handbook of Data on Organic Compounds, 2nd Editon, Weast,R.C and Grasselli, J.G., ed(s)., CRC Press, Inc., Boca Raton, FL, 1989, 1. [all data]
Lacher, McKinley, et al., 1949
Lacher, J.R.; McKinley, J.J.; Walden, C.; Lea, K.; Park, J.D.,
Reaction heats of organic fluorine compounds. II. The vapor phase heats of chlorination of some simple fluoroolefins,
J. Am. Chem. Soc., 1949, 71, 1334-1337. [all data]