Ethane, 1,1,2,2-tetrafluoro-1,2-dinitro-
- Formula: C2F4N2O4
- Molecular weight: 192.0260
- IUPAC Standard InChIKey: NELYAMNMZQGYAJ-UHFFFAOYSA-N
- CAS Registry Number: 356-16-1
- Chemical structure:
View 3d structure (requires JavaScript / HTML 5) - Permanent link for this species. Use this link for bookmarking this species for future reference.

Gas phase thermochemistry data

Data compiled by: Hussein Y. Afeefy, Joel F. Liebman, and Stephen E. Stein
Quantity | Value | Units | Method | Reference | Comment |
---|---|---|---|---|---|
ΔfH°gas | -812. ± 3. | kJ/mol | Ccb | Pepekin, Lebedev, et al., 1973 | hf_HF.30H2O=-77.01 kcal/mol and hf_CF4=-223.0 kcal/mol |

References

Pepekin, Lebedev, et al., 1973
Pepekin, V.I.; Lebedev, Yu.A.; Apin, A.Ya.,
Dissociation energies of C-F and C-C bonds in α-fluoronitro derivatives of methane and ethane,
Dokl. Akad. Nauk SSSR, 1973, 208, 153-155. [all data]