2,5-Piperazinedione, 3,6-dimethyl-, trans-
- Formula: C6H10N2O2
- Molecular weight: 142.1558
- IUPAC Standard InChIKey: WWISPHBAYBECQZ-ZXZARUISSA-N
- CAS Registry Number: 35590-65-9
- Chemical structure:
View 3d structure (requires JavaScript / HTML 5) - Stereoisomers:

Reaction thermochemistry data

Data compiled as indicated in comments:
ALS - Hussein Y. Afeefy, Joel F. Liebman, and Stephen E. Stein
RCD - Robert C. Dunbar
Individual Reactions
By formula: C6H10N2O2 = C6H10N2O2
Quantity | Value | Units | Method | Reference | Comment |
---|---|---|---|---|---|
ΔrH° | 0.9 ± 0.4 | kJ/mol | Eqk | Eguchi and Kakuta, 1974 | liquid phase; solvent: Ethanol/base; ALS |
By formula: Na+ + C6H10N2O2 = (Na+ • C6H10N2O2)
Quantity | Value | Units | Method | Reference | Comment |
---|---|---|---|---|---|
ΔrH° | 151. ± 7.1 | kJ/mol | CIDC | Cerda, Hoyau, et al., 1998 | RCD |

Ion clustering data

Data compiled by: Robert C. Dunbar
Clustering reactions
By formula: Na+ + C6H10N2O2 = (Na+ • C6H10N2O2)
Quantity | Value | Units | Method | Reference | Comment |
---|---|---|---|---|---|
ΔrH° | 151. ± 7.1 | kJ/mol | CIDC | Cerda, Hoyau, et al., 1998 |

References

Eguchi and Kakuta, 1974
Eguchi, C.; Kakuta, A.,
Studies on cyclic dipeptides. I. Thermodynamics of the cis-trans isomerization of the side chains in cyclic dipeptides,
J. Am. Chem. Soc., 1974, 96, 3985-3989. [all data]
Cerda, Hoyau, et al., 1998
Cerda, B.A.; Hoyau, S.; Ohanessian, G.; Wesdemiotis, C.,
PAs of Peptides,
J. Am. Chem. Soc., 1998, 120, 2437. [all data]