2,2,3,3,4,4,5,5-Octafluoro-1,6-hexanediol
- Formula: C6H6F8O2
- Molecular weight: 262.0979
- IUPAC Standard InChIKey: NHEKBXPLFJSSBZ-UHFFFAOYSA-N
- CAS Registry Number: 355-74-8
- Chemical structure:
View 3d structure (requires JavaScript / HTML 5) - Other names: 1,6-Hexanediol, 2,2,3,3,4,4,5,5-octafluoro-

Gas phase thermochemistry data

Data compiled by: Hussein Y. Afeefy, Joel F. Liebman, and Stephen E. Stein
Quantity | Value | Units | Method | Reference | Comment |
---|---|---|---|---|---|
ΔfH°gas | -2084. ± 12. | kJ/mol | Ccr | Kolesov, Slavutskaya, et al., 1974 | Reanalyzed by Kolesov and Kozina, 1986, Original value = -2059. ± 4.6 kJ/mol |

Condensed phase thermochemistry data

Data compiled by: Hussein Y. Afeefy, Joel F. Liebman, and Stephen E. Stein
Quantity | Value | Units | Method | Reference | Comment |
---|---|---|---|---|---|
ΔfH°solid | -2173.4 ± 4.7 | kJ/mol | Ccr | Kolesov, Slavutskaya, et al., 1974 | Reanalyzed by Kolesov and Kozina, 1986, Original value = -2148. ± 4.7 kJ/mol |
Quantity | Value | Units | Method | Reference | Comment |
ΔcH°solid | -2477. ± 4.6 | kJ/mol | Ccr | Kolesov, Slavutskaya, et al., 1974 |

Phase change data

Data compiled by: Hussein Y. Afeefy, Joel F. Liebman, and Stephen E. Stein
Quantity | Value | Units | Method | Reference | Comment |
---|---|---|---|---|---|
ΔsubH° | 89.2 ± 8.4 | kJ/mol | E | Kolesov, Slavutskaya, et al., 1974 |

References

Kolesov, Slavutskaya, et al., 1974
Kolesov, V.P.; Slavutskaya, G.M.; Aleksandrov, Yu.I.; Vartanov, V.P.; Novikov, G.A.,
Standard enthalpy of formation of 2,2,3,3,4,4,5,5-Octafluorohexane-1,6-diol,
Russ. J. Phys. Chem. (Engl. Transl.), 1974, 48, 460. [all data]
Kolesov and Kozina, 1986
Kolesov, V.P.; Kozina, M.P.,
Thermochemistry of organic and organohalogen compounds,
Russ. Chem. Rev., 1986, 55, 912. [all data]