Benzenamine, 2-methyl-3,5-dinitro-
- Formula: C7H7N3O4
- Molecular weight: 197.1482
- IUPAC Standard InChIKey: IEEJAAUSLQCGJH-UHFFFAOYSA-N
- CAS Registry Number: 35572-78-2
- Chemical structure:
View 3d structure (requires JavaScript / HTML 5) - Other names: 2-Amino-4,6-dinitrotoluene; 2,4-Dinitro-6-aminotoluene; 3,5-Dinitro-o-toluidine; 2-Methyl-3,5-dinitroaniline; o-Toluidine, 3,5-dinitro-; 2-Adnt; 2-Methyl-3,5-dinitrobenzenamine

Lee's RI, non-polar column, temperature ramp

Column type | Active phase | I | Reference | Comment |
---|---|---|---|---|
Capillary | DB-5MS | 330.74 | Chen, Keeran, et al., 2002 | 30. m/0.25 mm/0.5 μm, 40. C @ 1. min, 10. K/min; Tend: 310. C |

References

Chen, Keeran, et al., 2002
Chen, P.H.; Keeran, W.S.; Van Ausdale, W.A.; Schindler, D.R.; Roberts, D.W.,
Application of Lee retention indices to the confirmation of tentatively identified compounds from GC/MS analysis of environmental samples, Technical paper, Analytical Services Division, Environmental ScienceEngineering, Inc, PO Box 1703, Gainesville, FL 32602, 2002, 11. [all data]