1-pentadecanamine, N-pentadecyl-

Phase change data

Data compiled by: Thermodynamics Research Center, NIST Boulder Laboratories, Chris Muzny director

Quantity Value Units Method Reference Comment
Tfus336.45KN/AHoerr, Harwood, et al., 1946Uncertainty assigned by TRC = 0.6 K
Tfus336.45KN/AHoerr, Harwood, et al., 1944Uncertainty assigned by TRC = 1. K

In addition to the Thermodynamics Research Center (TRC) data available from this site, much more physical and chemical property data is available from the following TRC products:

References

Hoerr, Harwood, et al., 1946
Hoerr, C.W.; Harwood, H.J.; Ralston, A.W., Dimorphism of Symmetrical Normal Aliphatic Secondary Amines of High Molecular Weight., J. Org. Chem., 1946, 11, 199. [all data]

Hoerr, Harwood, et al., 1944
Hoerr, C.W.; Harwood, H.J.; Ralston, A.W., Solubilities of High-Molecular-Weight Symmetrical Normal Aliphatic Secondary Amines., J. Org. Chem., 1944, 9, 201-10. [all data]