3-Piperidinol, 1-methyl-
- Formula: C6H13NO
- Molecular weight: 115.1735
- IUPAC Standard InChIKey: UKANCZCEGQDKGF-UHFFFAOYSA-N
- CAS Registry Number: 3554-74-3
- Chemical structure:
View 3d structure (requires JavaScript / HTML 5) - Other names: N-Methyl-3-hydroxypiperidine; N-Methyl-3-piperidinol; 1-Methyl-3-hydroxypiperidine; 1-Methyl-3-piperidinol; 3-Hydroxy-N-methylpiperidine; 3-Hydroxy-1-methylpiperidine; 1-methylpiperidin-3-ol

Phase change data

Data compiled as indicated in comments:
BS - Robert L. Brown and Stephen E. Stein
AC - William E. Acree, Jr., James S. Chickos
Quantity | Value | Units | Method | Reference | Comment |
---|---|---|---|---|---|
ΔvapH° | 73.0 ± 0.6 | kJ/mol | C | Ribeiro da Silva and Cabral, 2006 | AC |
Reduced pressure boiling point
Tboil (K) | Pressure (bar) | Reference | Comment |
---|---|---|---|
350.2 | 0.015 | Weast and Grasselli, 1989 | BS |

Van Den Dool and Kratz RI, non-polar column, temperature ramp

Column type | Active phase | I | Reference | Comment |
---|---|---|---|---|
Capillary | SE-54 | 948. | Kostiainen, 2000 | 25. m/0.32 mm/0.25 μm, He, 40. C @ 1. min, 10. K/min, 280. C @ 10. min |

References

Ribeiro da Silva and Cabral, 2006
Ribeiro da Silva, Manuel A.V.; Cabral, Joana I.T.A.,
Experimental Study on the Thermochemistry of Some Derivatives of Piperidinol,
J. Chem. Eng. Data, 2006, 51, 2, 767-771, https://doi.org/10.1021/je050508n
. [all data]
Weast and Grasselli, 1989
CRC Handbook of Data on Organic Compounds, 2nd Editon, Weast,R.C and Grasselli, J.G., ed(s)., CRC Press, Inc., Boca Raton, FL, 1989, 1. [all data]