Butane, 1,2-dichlorooctafluoro-
- Formula: C4Cl2F8
- Molecular weight: 270.936
- IUPAC Standard InChIKey: VWEVIICQUWWWRQ-UHFFFAOYSA-N
- CAS Registry Number: 355-21-5
- Chemical structure:
View 3d structure (requires JavaScript / HTML 5) - Permanent link for this species. Use this link for bookmarking this species for future reference.

Reaction thermochemistry data

Data compiled by: Hussein Y. Afeefy, Joel F. Liebman, and Stephen E. Stein
Individual Reactions
By formula: C4F8 + Cl2 = C4Cl2F8
Quantity | Value | Units | Method | Reference | Comment |
---|---|---|---|---|---|
ΔrH° | -188.2 ± 1.3 | kJ/mol | Cm | Lacher, Kianpour, et al., 1957 | gas phase |

References

Lacher, Kianpour, et al., 1957
Lacher, J.R.; Kianpour, A.; Park, J.D.,
Reaction heats of organic halogen compounds. X. Vapor phase heats of hydrobromination of cyclopropane and propylene,
J. Phys. Chem., 1957, 61, 1124-1125. [all data]