2,4-Dimethoxypyrimidine

Phase change data

Data compiled by: Hussein Y. Afeefy, Joel F. Liebman, and Stephen E. Stein

Quantity Value Units Method Reference Comment
Δvap48. ± 3.kJ/molVBeak and White, 1982

Reaction thermochemistry data

Data compiled by: Hussein Y. Afeefy, Joel F. Liebman, and Stephen E. Stein

Individual Reactions

2,4-Dimethoxypyrimidine = 2,4(1H,3H)-Pyrimidinedione, 1,3-dimethyl-

By formula: C6H8N2O2 = C6H8N2O2

Quantity Value Units Method Reference Comment
Δr-44. ± 3.1kcal/molCisoBeak and White, 1982liquid phase
Δr-38. ± 4.7kcal/molCisoBeak and White, 1982gas phase

References

Beak and White, 1982
Beak, P.; White, J.M., Relative enthalpies of 1,3-dimethyl-2,4-pyrimidinedione, 2,4-dimethoxypyrimidine, and 4-methoxy-1-methyl-2-pyrimidinone: estimation of the relative stabilities of two protomers of uracil, J. Am. Chem. Soc., 1982, 104, 7073-7077. [all data]