Nitrosobenzene dimer
- Formula: C12H10N2O2
- Molecular weight: 214.2200
- IUPAC Standard InChIKey: WHFNSVMCGRQIRC-UHFFFAOYSA-N
- CAS Registry Number: 35506-28-6
- Chemical structure:
View 3d structure (requires JavaScript / HTML 5) - Stereoisomers:

Gas phase thermochemistry data

Data compiled by: Hussein Y. Afeefy, Joel F. Liebman, and Stephen E. Stein
Quantity | Value | Units | Method | Reference | Comment |
---|---|---|---|---|---|
ΔfH°gas | 328. ± 3. | kJ/mol | Ccb | Pepekin, Lebedev, et al., 1975 |

Condensed phase thermochemistry data

Data compiled by: Hussein Y. Afeefy, Joel F. Liebman, and Stephen E. Stein
Quantity | Value | Units | Method | Reference | Comment |
---|---|---|---|---|---|
ΔfH°solid | 241. ± 2. | kJ/mol | Ccb | Pepekin, Lebedev, et al., 1975 | |
Quantity | Value | Units | Method | Reference | Comment |
ΔcH°solid | -6393. ± 2. | kJ/mol | Ccb | Pepekin, Lebedev, et al., 1975 |

Phase change data

Data compiled by: Hussein Y. Afeefy, Joel F. Liebman, and Stephen E. Stein
Quantity | Value | Units | Method | Reference | Comment |
---|---|---|---|---|---|
ΔsubH° | 87.0 ± 0.8 | kJ/mol | V | Pepekin, Lebedev, et al., 1975 |

References

Pepekin, Lebedev, et al., 1975
Pepekin, V.I.; Lebedev, V.P.; Balepin, A.A.; Lebedev, Yu.A.,
Thermochemistry of C-nitroso compounds,
Dokl. Phys. Chem. (Engl. Transl.), 1975, 221, 370-373, In original 1118. [all data]