Perfluoro(2-methylpentane)
- Formula: C6F14
- Molecular weight: 338.0418
- IUPAC Standard InChIKey: ROVMKEZVKFJNBD-UHFFFAOYSA-N
- CAS Registry Number: 355-04-4
- Chemical structure:
View 3d structure (requires JavaScript / HTML 5) - Other names: Pentane, 1,1,1,2,2,3,3,4,5,5,5-undecafluoro-4-(trifluoromethyl)-; Pentane, undecafluoro-2-(trifluoromethyl)-; 2-Perfluoromethylpentane; 1,1,1,2,2,3,3,4,5,5,5-undecafluoro-4-(trifluoromethyl)pentane

Phase change data

Data compiled as indicated in comments:
TRC - Thermodynamics Research Center, NIST Boulder Laboratories, Chris Muzny director
AC - William E. Acree, Jr., James S. Chickos
Quantity | Value | Units | Method | Reference | Comment |
---|---|---|---|---|---|
Ttriple | 102.45 | K | N/A | Crowder, Taylor, et al., 1967 | Uncertainty assigned by TRC = 0.3 K; TRC |
Quantity | Value | Units | Method | Reference | Comment |
ΔvapH° | 31.4 | kJ/mol | N/A | Boublik, Fried, et al., 1984 | Based on data from 280. to 340. K. See also Basarová and Svoboda, 1991.; AC |
Enthalpy of vaporization
ΔvapH (kJ/mol) | Temperature (K) | Method | Reference | Comment |
---|---|---|---|---|
34.5 | 268. | A | Stephenson and Malanowski, 1987 | Based on data from 253. to 329. K. See also Crowder, Taylor, et al., 1967, 2 and Boublik, Fried, et al., 1984.; AC |
32.5 | 292. | N/A | Stiles and Cady, 1952 | Based on data from 277. to 341. K. See also Boublik, Fried, et al., 1984.; AC |
Antoine Equation Parameters
log10(P) = A − (B / (T + C))
P = vapor pressure (bar)
T = temperature (K)
View plot Requires a JavaScript / HTML 5 canvas capable browser.
Temperature (K) | A | B | C | Reference | Comment |
---|---|---|---|---|---|
253.93 to 451.11 | 4.04938 | 1108.035 | -56.584 | Crowder, Taylor, et al., 1967, 2 | Coefficents calculated by NIST from author's data. |
277.53 to 341.47 | 4.02124 | 1099.717 | -57.016 | Stiles and Cady, 1952 | Coefficents calculated by NIST from author's data. |

References

Crowder, Taylor, et al., 1967
Crowder, G.A.; Taylor, Z.L.; Reed, T.M.; Young, J.A.,
Vapor Pressures and Triple Point Temp. for Several Pure Fluorocarbons fluorocarbons,
J. Chem. Eng. Data, 1967, 12, 481. [all data]
Boublik, Fried, et al., 1984
Boublik, T.; Fried, V.; Hala, E.,
The Vapour Pressures of Pure Substances: Selected Values of the Temperature Dependence of the Vapour Pressures of Some Pure Substances in the Normal and Low Pressure Region, 2nd ed., Elsevier, New York, 1984, 972. [all data]
Basarová and Svoboda, 1991
Basarová, Pavlína; Svoboda, Václav,
Calculation of heats of vaporization of halogenated hydrocarbons from saturated vapour pressure data,
Fluid Phase Equilibria, 1991, 68, 13-34, https://doi.org/10.1016/0378-3812(91)85008-I
. [all data]
Stephenson and Malanowski, 1987
Stephenson, Richard M.; Malanowski, Stanislaw,
Handbook of the Thermodynamics of Organic Compounds, 1987, https://doi.org/10.1007/978-94-009-3173-2
. [all data]
Crowder, Taylor, et al., 1967, 2
Crowder, Gene A.; Taylor, Zelma Lowell; Reed, Thomas McKennan; Young, John Adams,
Vapor pressures and triple point temperatures for several pure fluorocarbons,
J. Chem. Eng. Data, 1967, 12, 4, 481-485, https://doi.org/10.1021/je60035a005
. [all data]
Stiles and Cady, 1952
Stiles, Vernon E.; Cady, George H.,
Physical Properties of Perfluoro-n-hexane and Perfluoro-2-methylpentane,
J. Am. Chem. Soc., 1952, 74, 15, 3771-3773, https://doi.org/10.1021/ja01135a017
. [all data]