butane, octafluoro-2,3-bis(trifluoromethyl)-
- Formula: C6F14
- Molecular weight: 338.0418
- IUPAC Standard InChIKey: NBQYGIPVNCVJJP-UHFFFAOYSA-N
- CAS Registry Number: 354-96-1
- Chemical structure:
View 3d structure (requires JavaScript / HTML 5) - Other names: Perfluoro-2,3-dimethylbutane

Phase change data

Data compiled as indicated in comments:
TRC - Thermodynamics Research Center, NIST Boulder Laboratories, Chris Muzny director
AC - William E. Acree, Jr., James S. Chickos
Quantity | Value | Units | Method | Reference | Comment |
---|---|---|---|---|---|
Ttriple | 258.05 | K | N/A | Crowder, Taylor, et al., 1967 | Uncertainty assigned by TRC = 0.3 K; TRC |
Quantity | Value | Units | Method | Reference | Comment |
ΔvapH° | 31.6 | kJ/mol | N/A | Boublik, Fried, et al., 1984 | Based on data from 260. to 340. K. See also Basarová and Svoboda, 1991.; AC |
Enthalpy of vaporization
ΔvapH (kJ/mol) | Temperature (K) | Method | Reference | Comment |
---|---|---|---|---|
33.0 | 277. | A | Stephenson and Malanowski, 1987 | Based on data from 262. to 333. K. See also Crowder, Taylor, et al., 1967, 2 and Boublik, Fried, et al., 1984.; AC |

References

Crowder, Taylor, et al., 1967
Crowder, G.A.; Taylor, Z.L.; Reed, T.M.; Young, J.A.,
Vapor Pressures and Triple Point Temp. for Several Pure Fluorocarbons fluorocarbons,
J. Chem. Eng. Data, 1967, 12, 481. [all data]
Boublik, Fried, et al., 1984
Boublik, T.; Fried, V.; Hala, E.,
The Vapour Pressures of Pure Substances: Selected Values of the Temperature Dependence of the Vapour Pressures of Some Pure Substances in the Normal and Low Pressure Region, 2nd ed., Elsevier, New York, 1984, 972. [all data]
Basarová and Svoboda, 1991
Basarová, Pavlína; Svoboda, Václav,
Calculation of heats of vaporization of halogenated hydrocarbons from saturated vapour pressure data,
Fluid Phase Equilibria, 1991, 68, 13-34, https://doi.org/10.1016/0378-3812(91)85008-I
. [all data]
Stephenson and Malanowski, 1987
Stephenson, Richard M.; Malanowski, Stanislaw,
Handbook of the Thermodynamics of Organic Compounds, 1987, https://doi.org/10.1007/978-94-009-3173-2
. [all data]
Crowder, Taylor, et al., 1967, 2
Crowder, Gene A.; Taylor, Zelma Lowell; Reed, Thomas McKennan; Young, John Adams,
Vapor pressures and triple point temperatures for several pure fluorocarbons,
J. Chem. Eng. Data, 1967, 12, 4, 481-485, https://doi.org/10.1021/je60035a005
. [all data]