Propane, 1,2-dichloropentafluoro-2-(trifluoromethyl)-
- Formula: C4Cl2F8
- Molecular weight: 270.936
- IUPAC Standard InChIKey: SCNOJVKMNLBGCR-UHFFFAOYSA-N
- CAS Registry Number: 354-91-6
- Chemical structure:
View 3d structure (requires JavaScript / HTML 5) - Permanent link for this species. Use this link for bookmarking this species for future reference.

Reaction thermochemistry data

Data compiled by: Hussein Y. Afeefy, Joel F. Liebman, and Stephen E. Stein
Individual Reactions
By formula: C4F8 + Cl2 = C4Cl2F8
Quantity | Value | Units | Method | Reference | Comment |
---|---|---|---|---|---|
ΔrH° | -176.6 ± 2.1 | kJ/mol | Cm | Lacher, Kianpour, et al., 1957 | gas phase |

References

Lacher, Kianpour, et al., 1957
Lacher, J.R.; Kianpour, A.; Park, J.D.,
Reaction heats of organic halogen compounds. VIII. The heats of chlorination of perfluorinated butene-1 pentene-1 and isobutene,
J. Phys. Chem., 1957, 61, 584-586. [all data]