2,3,4,6-tetramethylindole
- Formula: C12H15N
- Molecular weight: 173.2542
- CAS Registry Number: 35490-92-7

Phase change data

Data compiled by: Thermodynamics Research Center, NIST Boulder Laboratories, Chris Muzny director
Quantity | Value | Units | Method | Reference | Comment |
---|---|---|---|---|---|
Tfus | 402. | K | N/A | Borsche and Groth, 1941 | Uncertainty assigned by TRC = 2. K |

References

Borsche and Groth, 1941
Borsche, W.; Groth, H.,
Acylation of indoles and quinolines by the Friedel-Crafts reaction.,
Justus Liebigs Ann. Chem., 1941, 549, 238-55. [all data]