Ethanol, 2-(octylthio)-
- Formula: C10H22OS
- Molecular weight: 190.346
- IUPAC Standard InChIKey: KXPXKNBDCUOENF-UHFFFAOYSA-N
- CAS Registry Number: 3547-33-9
- Chemical structure:
View 3d structure (requires JavaScript / HTML 5) - Other names: MGK Repellent 874; MGK 874; R-874; 2-(Octylthio)ethanol; 2-Hydroxyethyl n-octyl sulfide; 2-Hydroxyethyl octyl sulfide; β-Hydroxyethyl n-octyl sulfide; r-874 Phillips; MGK repellent R-874; 2-(Oktylthio)ethanol; NSC 163967

Kovats' RI, non-polar column, isothermal

Column type | Active phase | Temperature (C) | I | Reference | Comment |
---|---|---|---|---|---|
Packed | SE-30 | 170. | 1562. | Voelkel, 1987 | He, Chromaton N Super (75-100 mesh); Column length: 1. m |

References

Voelkel, 1987
Voelkel, A.,
Retention Indices and Thermodynamic Functions of Solution for Model Non-Ionic Surfactants in Standard Stationary Phases Determined by Gas Chromatography,
J. Chromatogr., 1987, 387, 95-104, https://doi.org/10.1016/S0021-9673(01)94516-9
. [all data]