1-Hepten-1-yl acetate
- Formula: C9H16O2
- Molecular weight: 156.2221
- IUPAC Standard InChIKey: JMFFUDMJDZXYCT-BQYQJAHWSA-N
- CAS Registry Number: 35468-97-4
- Chemical structure:
View 3d structure (requires JavaScript / HTML 5) - Other names: hept-1-en-1-ol acetate; 1-heptenyl acetate; hept-1-enyl acetate

Kovats' RI, non-polar column, temperature ramp

Column type | Active phase | I | Reference | Comment |
---|---|---|---|---|
Capillary | Methyl Silicone | 1234.0 | Rao, Rajanikanth, et al., 1989 | 4. K/min, 250. C @ 15. min; Column length: 12. m; Column diameter: 0.5 mm; Tstart: 70. C |

Normal alkane RI, polar column, temperature ramp

Column type | Active phase | I | Reference | Comment |
---|---|---|---|---|
Capillary | DB-Wax | 1441. | Choi, 2004 | 60. m/0.25 mm/0.25 μm, N2, 70. C @ 2. min, 2. K/min, 230. C @ 20. min |
Capillary | DB-Wax | 1444. | Choi, 2004, 2 | 60. m/0.25 mm/0.25 μm, N2, 70. C @ 2. min, 2. K/min, 230. C @ 20. min |

References

Rao, Rajanikanth, et al., 1989
Rao, A.S.; Rajanikanth, B.; Seshadri, R.,
Volatile aroma components of Curcuma amada Roxb.,
J. Agric. Food Chem., 1989, 37, 3, 740-743, https://doi.org/10.1021/jf00087a036
. [all data]
Choi, 2004
Choi, H.-S.,
Volatile constituents of satsuma mandarins growing in Korea,
Flavour Fragr. J., 2004, 19, 5, 406-412, https://doi.org/10.1002/ffj.1283
. [all data]
Choi, 2004, 2
Choi, H.-S.,
Aroma evaluation of an aquatic herb, changpo (Acorus calamus Var. angustatus Bess), by AEDA and SPME,
J. Agric. Food Chem., 2004, 52, 26, 8099-8104, https://doi.org/10.1021/jf040239p
. [all data]