1,2-Dibromo-1-chloro-1,2,2-trifluoroethane
- Formula: C2Br2ClF3
- Molecular weight: 276.278
- IUPAC Standard InChIKey: OVZATIUQXBLIQT-UHFFFAOYSA-N
- CAS Registry Number: 354-51-8
- Chemical structure:
View 3d structure (requires JavaScript / HTML 5) - Other names: 2-Chloro-1,2-dibromo-1,1,2-trifluoroethane; Ethane, 1,2-dibromo-1-chloro-1,2,2-trifluoro-; 1,2-Dibromochlorotrifluoroethane; 1,2-Dibromo-1-chlorotrifluoroethane; 1,2-Dibromotrifluorochloroethane; Freon 113B2; 1-Chloro-1,2-dibromo-1,2,2-trifluoro ethane

Phase change data

Data compiled as indicated in comments:
BS - Robert L. Brown and Stephen E. Stein
AC - William E. Acree, Jr., James S. Chickos
Quantity | Value | Units | Method | Reference | Comment |
---|---|---|---|---|---|
Tboil | 366. to 367. | K | N/A | PCR Inc., 1990 | BS |
Tboil | 366. | K | N/A | Majer and Svoboda, 1985 | |
Quantity | Value | Units | Method | Reference | Comment |
Tc | 560.7 | K | N/A | Majer and Svoboda, 1985 | |
Quantity | Value | Units | Method | Reference | Comment |
ΔvapH° | 35.11 | kJ/mol | N/A | Majer and Svoboda, 1985 | |
ΔvapH° | 35.0 ± 0.1 | kJ/mol | C | Majer, Svoboda, et al., 1981 | AC |
Enthalpy of vaporization
ΔvapH (kJ/mol) | Temperature (K) | Method | Reference | Comment |
---|---|---|---|---|
31.17 | 366. | N/A | Majer and Svoboda, 1985 | |
31.4 | 358. | A | Stephenson and Malanowski, 1987 | Based on data from 343. to 428. K.; AC |
34.2 ± 0.1 | 313. | C | Majer, Svoboda, et al., 1981 | AC |
33.5 ± 0.1 | 328. | C | Majer, Svoboda, et al., 1981 | AC |
32.6 ± 0.1 | 343. | C | Majer, Svoboda, et al., 1981 | AC |
31.6 ± 0.1 | 358. | C | Majer, Svoboda, et al., 1981 | AC |
Enthalpy of vaporization
ΔvapH =
A exp(-βTr) (1 − Tr)β
ΔvapH =
Enthalpy of vaporization (at saturation pressure)
(kJ/mol)
Tr = reduced temperature (T / Tc)
View plot Requires a JavaScript / HTML 5 canvas capable browser.
Temperature (K) | A (kJ/mol) | β | Tc (K) | Reference | Comment |
---|---|---|---|---|---|
298. to 358. | 50.19 | 0.2786 | 560.7 | Majer and Svoboda, 1985 |

Reaction thermochemistry data

Data compiled by: Hussein Y. Afeefy, Joel F. Liebman, and Stephen E. Stein
Individual Reactions
By formula: Br2 + C2ClF3 = C2Br2ClF3
Quantity | Value | Units | Method | Reference | Comment |
---|---|---|---|---|---|
ΔrH° | -132.3 | kJ/mol | Cm | Lacher, Casali, et al., 1956 | gas phase; Heat of bromination |
By formula: C2Br2ClF3 = Br2 + C2ClF3
Quantity | Value | Units | Method | Reference | Comment |
---|---|---|---|---|---|
ΔrH° | 132.25 | kJ/mol | Cm | Lacher, Casali, et al., 1956 | gas phase |

References

PCR Inc., 1990
PCR Inc.,
Research Chemicals Catalog 1990-1991, PCR Inc., Gainesville, FL, 1990, 1. [all data]
Majer and Svoboda, 1985
Majer, V.; Svoboda, V.,
Enthalpies of Vaporization of Organic Compounds: A Critical Review and Data Compilation, Blackwell Scientific Publications, Oxford, 1985, 300. [all data]
Majer, Svoboda, et al., 1981
Majer, Vladimír; Svoboda, Václav; Posta, Antonín; Pick, Jirí,
Determination of heats of vaporization and some other thermodynamic quantities for three fluorinated halogen ethanes,
Collect. Czech. Chem. Commun., 1981, 46, 4, 817-822, https://doi.org/10.1135/cccc19810817
. [all data]
Stephenson and Malanowski, 1987
Stephenson, Richard M.; Malanowski, Stanislaw,
Handbook of the Thermodynamics of Organic Compounds, 1987, https://doi.org/10.1007/978-94-009-3173-2
. [all data]
Lacher, Casali, et al., 1956
Lacher, J.R.; Casali, L.; Park, J.D.,
Reaction heats of organic halogen compounds V. The vapor phase bromination of tetrafluoroethylene and trifluorochloroethylene,
J. Phys. Chem., 1956, 60, 608-610. [all data]