Trifluoroacetyl fluoride
- Formula: C2F4O
- Molecular weight: 116.0144
- CAS Registry Number: 354-34-7

Condensed phase thermochemistry data

Data compiled by: Eugene S. Domalski and Elizabeth D. Hearing
Quantity | Value | Units | Method | Reference | Comment |
---|---|---|---|---|---|
S°liquid | 216.48 | J/mol*K | N/A | Pace and Hodge, 1972 |
Constant pressure heat capacity of liquid
Cp,liquid (J/mol*K) | Temperature (K) | Reference | Comment |
---|---|---|---|
138.95 | 214.0 | Pace and Hodge, 1972 | T = 14 to 214 K. |

Phase change data

Data compiled as indicated in comments:
BS - Robert L. Brown and Stephen E. Stein
TRC - Thermodynamics Research Center, NIST Boulder Laboratories, Chris Muzny director
DH - Eugene S. Domalski and Elizabeth D. Hearing
AC - William E. Acree, Jr., James S. Chickos
Quantity | Value | Units | Method | Reference | Comment |
---|---|---|---|---|---|
Tboil | 214. | K | N/A | PCR Inc., 1990 | BS |
Tboil | 233. | K | N/A | Anonymous, 1957 | Uncertainty assigned by TRC = 5. K; TRC |
Quantity | Value | Units | Method | Reference | Comment |
Ttriple | 113.69 | K | N/A | Pace and Hodge, 1972, 2 | Uncertainty assigned by TRC = 0.02 K; TRC |
Ttriple | 113.69 | K | N/A | Hodge, 1971 | Uncertainty assigned by TRC = 0.05 K; TRC |
Enthalpy of vaporization
ΔvapH (kJ/mol) | Temperature (K) | Method | Reference | Comment |
---|---|---|---|---|
19.207 | 214.10 | N/A | Pace and Hodge, 1972 | P = 101.325 kPa; DH |
19.267 | 214.10 | N/A | Hodge, 1971, 2 | DH |
20.9 | 200. | A | Stephenson and Malanowski, 1987 | Based on data from 161. to 215. K. See also Pace and Hodge, 1972.; AC |
Entropy of vaporization
ΔvapS (J/mol*K) | Temperature (K) | Reference | Comment |
---|---|---|---|
89.99 | 214.10 | Pace and Hodge, 1972 | P; DH |
89.99 | 214.10 | Hodge, 1971, 2 | DH |
Antoine Equation Parameters
log10(P) = A − (B / (T + C))
P = vapor pressure (bar)
T = temperature (K)
View plot Requires a JavaScript / HTML 5 canvas capable browser.
Temperature (K) | A | B | C | Reference | Comment |
---|---|---|---|---|---|
161.94 to 214.27 | 4.21705 | 765.587 | -32.284 | Pace and Hodge, 1972 | Coefficents calculated by NIST from author's data. |
Enthalpy of fusion
ΔfusH (kJ/mol) | Temperature (K) | Reference | Comment |
---|---|---|---|
4.870 | 113.69 | Pace and Hodge, 1972 | DH |
4.869 | 113.69 | Hodge, 1971, 2 | DH |
Entropy of fusion
ΔfusS (J/mol*K) | Temperature (K) | Reference | Comment |
---|---|---|---|
42.84 | 113.69 | Pace and Hodge, 1972 | DH |
42.83 | 113.69 | Hodge, 1971, 2 | DH |

Henry's Law data

Data compiled by: Rolf Sander
Henry's Law constant (water solution)
kH(T) = k°H exp(d(ln(kH))/d(1/T) ((1/T) - 1/(298.15 K)))
k°H = Henry's law constant for solubility in water at 298.15 K (mol/(kg*bar))
d(ln(kH))/d(1/T) = Temperature dependence constant (K)
k°H (mol/(kg*bar)) | d(ln(kH))/d(1/T) (K) | Method | Reference |
---|---|---|---|
3.0 | M | N/A | |
3.0 | C | N/A |

Gas phase ion energetics data

Data evaluated by: Edward P. Hunter and Sharon G. Lias
Quantity | Value | Units | Method | Reference | Comment |
---|---|---|---|---|---|
Proton affinity (review) | 668.6 | kJ/mol | N/A | Hunter and Lias, 1998 | |
Quantity | Value | Units | Method | Reference | Comment |
Gas basicity | 636.7 | kJ/mol | N/A | Hunter and Lias, 1998 |

Reaction thermochemistry data

Data compiled as indicated in comments:
B - John E. Bartmess
M - Michael M. Meot-Ner (Mautner) and Sharon G. Lias

Individual Reactions

Fluorine anion + C2F4O = (Fluorine anion • C2F4O)

By formula: F- + C2F4O = (F- • C2F4O)

Quantity Value Units Method Reference Comment
Δr191. ± 8.4kJ/molIMRELarson and McMahon, 1985gas phase; These relative affinities are ca. 10 kcal/mol weaker than threshold values (see Wenthold and Squires, 1995) for donors greater than ca. 27 kcal/mol in free energy. This discrepancy has not yet been resolved, though the stronger value appears preferable.; B,M
Quantity Value Units Method Reference Comment
Δr120.J/mol*KN/ALarson and McMahon, 1985gas phase; switching reaction,Thermochemical ladder(F-)H2O, Entropy change calculated or estimated; Arshadi, Yamdagni, et al., 1970; M
Quantity Value Units Method Reference Comment
Δr156. ± 8.4kJ/molIMRELarson and McMahon, 1985gas phase; These relative affinities are ca. 10 kcal/mol weaker than threshold values (see Wenthold and Squires, 1995) for donors greater than ca. 27 kcal/mol in free energy. This discrepancy has not yet been resolved, though the stronger value appears preferable.; B,M

CN- + C2F4O = (CN- • C2F4O)

By formula: CN- + C2F4O = (CN- • C2F4O)

Quantity Value Units Method Reference Comment
Δr150.J/mol*KN/ALarson, Szulejko, et al., 1988gas phase; switching reaction,Thermochemical ladder(CN-)H2O, Entropy change calculated or estimated; Payzant, Yamdagni, et al., 1971; M
Δr150.J/mol*KN/ALarson, Szulejko, et al., 1988gas phase; switching reaction,Thermochemical ladder(CN-)H2O, Entropy change calculated or estimated; Payzant, Yamdagni, et al., 1971; M

Chlorine anion + C2F4O = (Chlorine anion • C2F4O)

By formula: Cl- + C2F4O = (Cl- • C2F4O)

Quantity Value Units Method Reference Comment
Δr69.9 ± 8.4kJ/molIMRELarson and McMahon, 1985gas phase; B,M
Quantity Value Units Method Reference Comment
Δr92.J/mol*KN/ALarson and McMahon, 1985gas phase; switching reaction,Thermochemical ladder(Cl-)t-C4H9OH, Entropy change calculated or estimated; M
Quantity Value Units Method Reference Comment
Δr42.3 ± 8.4kJ/molIMRELarson and McMahon, 1985gas phase; B,M

Ion clustering data

Data compiled as indicated in comments:
M - Michael M. Meot-Ner (Mautner) and Sharon G. Lias
B - John E. Bartmess

Clustering reactions

CN- + C2F4O = (CN- • C2F4O)

By formula: CN- + C2F4O = (CN- • C2F4O)

Quantity Value Units Method Reference Comment
Δr35.cal/mol*KN/ALarson, Szulejko, et al., 1988gas phase; switching reaction,Thermochemical ladder(CN-)H2O, Entropy change calculated or estimated; Payzant, Yamdagni, et al., 1971; M
Δr35.cal/mol*KN/ALarson, Szulejko, et al., 1988gas phase; switching reaction,Thermochemical ladder(CN-)H2O, Entropy change calculated or estimated; Payzant, Yamdagni, et al., 1971; M

Chlorine anion + C2F4O = (Chlorine anion • C2F4O)

By formula: Cl- + C2F4O = (Cl- • C2F4O)

Quantity Value Units Method Reference Comment
Δr16.7 ± 2.0kcal/molIMRELarson and McMahon, 1985gas phase; B,M
Quantity Value Units Method Reference Comment
Δr22.cal/mol*KN/ALarson and McMahon, 1985gas phase; switching reaction,Thermochemical ladder(Cl-)t-C4H9OH, Entropy change calculated or estimated; M
Quantity Value Units Method Reference Comment
Δr10.1 ± 2.0kcal/molIMRELarson and McMahon, 1985gas phase; B,M

Fluorine anion + C2F4O = (Fluorine anion • C2F4O)

By formula: F- + C2F4O = (F- • C2F4O)

Quantity Value Units Method Reference Comment
Δr45.6 ± 2.0kcal/molIMRELarson and McMahon, 1985gas phase; These relative affinities are ca. 10 kcal/mol weaker than threshold values (see Wenthold and Squires, 1995) for donors greater than ca. 27 kcal/mol in free energy. This discrepancy has not yet been resolved, though the stronger value appears preferable.; B,M
Quantity Value Units Method Reference Comment
Δr28.cal/mol*KN/ALarson and McMahon, 1985gas phase; switching reaction,Thermochemical ladder(F-)H2O, Entropy change calculated or estimated; Arshadi, Yamdagni, et al., 1970; M
Quantity Value Units Method Reference Comment
Δr37.2 ± 2.0kcal/molIMRELarson and McMahon, 1985gas phase; These relative affinities are ca. 10 kcal/mol weaker than threshold values (see Wenthold and Squires, 1995) for donors greater than ca. 27 kcal/mol in free energy. This discrepancy has not yet been resolved, though the stronger value appears preferable.; B,M

References

Pace and Hodge, 1972
Pace, E.L.; Hodge, P.E.,
Thermodynamic properties of trifluoroacetyl fluoride from 14 K to its boiling temperature,
J. Chem. Thermodynam., 1972, 4, 441-447. [all data]
PCR Inc., 1990
PCR Inc.,
Research Chemicals Catalog 1990-1991, PCR Inc., Gainesville, FL, 1990, 1. [all data]
Anonymous, 1957
Anonymous, P.,
, 1957. [all data]
Pace and Hodge, 1972, 2
Pace, E.L.; Hodge, P.E.,
Thermocynamic Properties of Trifluoroacetyl Fluoride from 14 K to its Boiling Temperature,
J. Chem. Thermodyn., 1972, 4, 441-7. [all data]
Hodge, 1971
Hodge, P.E.,
The thermodynamic properties of trifluoroacetyl fluoride from 14 K to its boiling point and the thermodynamic properties of oxalyl fluoride from 130K to its normal boiling point. molecular data, Ph.D. Dissertation, Case Western Reserve University, Cleve- land, OH, 1971. [all data]
Hodge, 1971, 2
Hodge, P.E.,
The thermodynamic properties of trifluoroacetyl fluoride from 14 K to its normal boiling point and the thermodynamic properties of oxalyl fluoride from 130K to its normal boiling point. The entropies from spectroscopic and molecular data,
Diss. Abstr., 1971, 32, 1482-1483. [all data]
Stephenson and Malanowski, 1987
Stephenson, Richard M.; Malanowski, Stanislaw,
Handbook of the Thermodynamics of Organic Compounds, 1987, https://doi.org/10.1007/978-94-009-3173-2
. [all data]
Hunter and Lias, 1998
Hunter, E.P.; Lias, S.G.,
Evaluated Gas Phase Basicities and Proton Affinities of Molecules: An Update,
J. Phys. Chem. Ref. Data, 1998, 27, 3, 413-656, https://doi.org/10.1063/1.556018
. [all data]