Ethane, pentafluoro-
- Formula: C2HF5
- Molecular weight: 120.0214
- IUPAC Standard InChIKey: GTLACDSXYULKMZ-UHFFFAOYSA-N
- CAS Registry Number: 354-33-6
- Chemical structure:
View 3d structure (requires JavaScript / HTML 5) - Other names: C2F5H; Pentafluoroethane; 1,1,1,2,2-Pentafluoroethane; Fc-125; Genetron HFC 125; R-125

Phase change data

Data compiled as indicated in comments:
BS - Robert L. Brown and Stephen E. Stein
TRC - Thermodynamics Research Center, NIST Boulder Laboratories, Chris Muzny director
AC - William E. Acree, Jr., James S. Chickos
Quantity | Value | Units | Method | Reference | Comment |
---|---|---|---|---|---|
Tboil | 227. ± 6. | K | AVG | N/A | Average of 11 values; Individual data points |
Quantity | Value | Units | Method | Reference | Comment |
Tfus | 170. | K | N/A | Young, Fukuhara, et al., 1940 | Uncertainty assigned by TRC = 3. K; TRC |
Quantity | Value | Units | Method | Reference | Comment |
Tc | 339.22 | K | N/A | Yata, Hori, et al., 1996 | Uncertainty assigned by TRC = 0.3 K; TRC |
Tc | 339.160 | K | N/A | Kuwabara, Aoyama, et al., 1995 | Uncertainty assigned by TRC = 0.04 K; TRC |
Tc | 339.17 | K | N/A | Higashi, 1994 | Uncertainty assigned by TRC = 0.03 K; TRC |
Tc | 339.4 | K | N/A | Wilson, Wilding, et al., 1992 | Uncertainty assigned by TRC = 0.7 K; TRC |
Quantity | Value | Units | Method | Reference | Comment |
Pc | 36.29 | bar | N/A | Tsvetkov, Kletskii, et al., 1995 | Uncertainty assigned by TRC = 0.06 bar; by extrapolation of obs. vapor pressure to selected Tc; TRC |
Pc | 36.199 | bar | N/A | Ye, Sato, et al., 1995 | Uncertainty assigned by TRC = 0.03 bar; calc. from vapor pressure equation fit to data at selected Tc(339.165 K); TRC |
Pc | 36.20 | bar | N/A | Higashi, 1994 | Uncertainty assigned by TRC = 0.07 bar; TRC |
Pc | 36.19 | bar | N/A | Sagawa, Sato, et al., 1994 | Uncertainty assigned by TRC = 0.05 bar; Calculated from vapor pressure curve for Tc = 339.165 K; TRC |
Pc | 35.19 | bar | N/A | Wilson, Wilding, et al., 1992 | Uncertainty assigned by TRC = 1.50 bar; by extrapoltion of vapor pressure equation to Tc; TRC |
Quantity | Value | Units | Method | Reference | Comment |
ρc | 4.73 | mol/l | N/A | Kuwabara, Aoyama, et al., 1995 | Uncertainty assigned by TRC = 0.02 mol/l; TRC |
ρc | 4.7658 | mol/l | N/A | Higashi, 1994 | Uncertainty assigned by TRC = 0.05 mol/l; TRC |
ρc | 4.757 | mol/l | N/A | Wilson, Wilding, et al., 1992 | Uncertainty assigned by TRC = 0.07 mol/l; TRC |
Enthalpy of vaporization
ΔvapH (kJ/mol) | Temperature (K) | Method | Reference | Comment |
---|---|---|---|---|
22.8 | 175. | C | Weber, 1999 | AC |
21.9 | 190. | C | Weber, 1999 | AC |
20.9 | 205. | C | Weber, 1999 | AC |
20.3 | 215. | C | Weber, 1999 | AC |
Enthalpy of fusion
ΔfusH (kJ/mol) | Temperature (K) | Reference | Comment |
---|---|---|---|
2.25 | 172.6 | L«65533»ddecke and Magee, 1996 | AC |

Reaction thermochemistry data

Data compiled as indicated in comments:
B - John E. Bartmess
M - Michael M. Meot-Ner (Mautner) and Sharon G. Lias
ALS - Hussein Y. Afeefy, Joel F. Liebman, and Stephen E. Stein
Individual Reactions
By formula: Cl- + C2HF5 = (Cl- • C2HF5)
Quantity | Value | Units | Method | Reference | Comment |
---|---|---|---|---|---|
ΔrH° | 78.7 ± 8.4 | kJ/mol | IMRE | Larson and McMahon, 1984 | gas phase; B,M |
Quantity | Value | Units | Method | Reference | Comment |
ΔrS° | 97.5 | J/mol*K | N/A | Larson and McMahon, 1984, 2 | gas phase; switching reaction(Cl-)t-C4H9OH, Entropy change calculated or estimated; French, Ikuta, et al., 1982; M |
Quantity | Value | Units | Method | Reference | Comment |
ΔrG° | 49.4 ± 8.4 | kJ/mol | IMRE | Larson and McMahon, 1984 | gas phase; B,M |
By formula: F- + C2HF5 = (F- • C2HF5)
Quantity | Value | Units | Method | Reference | Comment |
---|---|---|---|---|---|
ΔrH° | 127. ± 8.4 | kJ/mol | IMRE | Larson and McMahon, 1983 | gas phase; B,M |
Quantity | Value | Units | Method | Reference | Comment |
ΔrS° | 111. | J/mol*K | N/A | Larson and McMahon, 1983 | gas phase; switching reaction(F-)H2O, Entropy change calculated or estimated; Arshadi, Yamdagni, et al., 1970; M |
Quantity | Value | Units | Method | Reference | Comment |
ΔrG° | 94.1 ± 8.4 | kJ/mol | IMRE | Larson and McMahon, 1983 | gas phase; B,M |
C2F5- + =
By formula: C2F5- + H+ = C2HF5
Quantity | Value | Units | Method | Reference | Comment |
---|---|---|---|---|---|
ΔrH° | 1567. ± 14. | kJ/mol | G+TS | Sullivan and Beauchamp, 1976 | gas phase; Between tBuOH and HF; value altered from reference due to change in acidity scale; B |
Quantity | Value | Units | Method | Reference | Comment |
ΔrG° | 1535. ± 13. | kJ/mol | IMRB | Sullivan and Beauchamp, 1976 | gas phase; Between tBuOH and HF; value altered from reference due to change in acidity scale; B |
By formula: C2HClF4 + HF = C2HF5 + HCl
Quantity | Value | Units | Method | Reference | Comment |
---|---|---|---|---|---|
ΔrH° | -10.5 ± 6.3 | kJ/mol | Kin | Coulson, 1993 | gas phase; solvent: On solid catalyst; ALS |

Gas phase ion energetics data

Data compiled by: John E. Bartmess
De-protonation reactions
C2F5- + =
By formula: C2F5- + H+ = C2HF5
Quantity | Value | Units | Method | Reference | Comment |
---|---|---|---|---|---|
ΔrH° | 1567. ± 14. | kJ/mol | G+TS | Sullivan and Beauchamp, 1976 | gas phase; Between tBuOH and HF; value altered from reference due to change in acidity scale |
Quantity | Value | Units | Method | Reference | Comment |
ΔrG° | 1535. ± 13. | kJ/mol | IMRB | Sullivan and Beauchamp, 1976 | gas phase; Between tBuOH and HF; value altered from reference due to change in acidity scale |

Ion clustering data

Data compiled as indicated in comments:
B - John E. Bartmess
M - Michael M. Meot-Ner (Mautner) and Sharon G. Lias
Clustering reactions
By formula: Cl- + C2HF5 = (Cl- • C2HF5)
Quantity | Value | Units | Method | Reference | Comment |
---|---|---|---|---|---|
ΔrH° | 78.7 ± 8.4 | kJ/mol | IMRE | Larson and McMahon, 1984 | gas phase; B,M |
Quantity | Value | Units | Method | Reference | Comment |
ΔrS° | 97.5 | J/mol*K | N/A | Larson and McMahon, 1984, 2 | gas phase; switching reaction(Cl-)t-C4H9OH, Entropy change calculated or estimated; French, Ikuta, et al., 1982; M |
Quantity | Value | Units | Method | Reference | Comment |
ΔrG° | 49.4 ± 8.4 | kJ/mol | IMRE | Larson and McMahon, 1984 | gas phase; B,M |
By formula: F- + C2HF5 = (F- • C2HF5)
Quantity | Value | Units | Method | Reference | Comment |
---|---|---|---|---|---|
ΔrH° | 127. ± 8.4 | kJ/mol | IMRE | Larson and McMahon, 1983 | gas phase; B,M |
Quantity | Value | Units | Method | Reference | Comment |
ΔrS° | 111. | J/mol*K | N/A | Larson and McMahon, 1983 | gas phase; switching reaction(F-)H2O, Entropy change calculated or estimated; Arshadi, Yamdagni, et al., 1970; M |
Quantity | Value | Units | Method | Reference | Comment |
ΔrG° | 94.1 ± 8.4 | kJ/mol | IMRE | Larson and McMahon, 1983 | gas phase; B,M |

References

Young, Fukuhara, et al., 1940
Young, D.W.S.; Fukuhara, N.; Bigelow, L.A.,
The Action of Elementary Fluorine Upon Organic Compounds VIII. The Influence of Dilution on the Vapor Phase Fluorination of Ethane,
J. Am. Chem. Soc., 1940, 62, 1171. [all data]
Yata, Hori, et al., 1996
Yata, J.; Hori, M.; Kawakatsu, H.; Minamiyama, T.,
Measurements of refractive index of alternative refrigerants,
Int. J. Thermophys., 1996, 17, 65-74. [all data]
Kuwabara, Aoyama, et al., 1995
Kuwabara, S.; Aoyama, H.; Sato, H.; Watanabe, K.,
Vapor-liquid coexistence curves in the critical region and the critical temperatures and densities of difluoromethane and pentafluoroehtane,
J. Chem. Eng. Data, 1995, 40, 112-116. [all data]
Higashi, 1994
Higashi, Y.,
Critical parameters for HFC134a, HFC32 and HFC125,
Int. J. Refrig., 1994, 17, 524-531. [all data]
Wilson, Wilding, et al., 1992
Wilson, L.C.; Wilding, W.V.; Wilson, G.M.; Rowley, R.L.; Felix, V.M.; Chisolm-Carter, T.,
Thermophysical properties of HFC-125,
Fluid Phase Equilib., 1992, 80, 167-77. [all data]
Tsvetkov, Kletskii, et al., 1995
Tsvetkov, O.B.; Kletskii, A.V.; Laptev, Yu.A.; Asambaev, A.J.; Zausaev, I.A.,
Thermal conductivity and PVT measurements of pentafluoroethane ( refrigerant HFC-125),
Int. J. Thermophys., 1995, 16, 1185-92. [all data]
Ye, Sato, et al., 1995
Ye, F.; Sato, H.; Watanabe, K.,
Gas-phase PVT properties and vapor pressure of pentafluoroethane (HFC-125) determined according to the burnett method,
J. Chem. Eng. Data, 1995, 40, 148-152. [all data]
Sagawa, Sato, et al., 1994
Sagawa, T.; Sato, H.; Watanabe, K.,
Thermodynamic properties of HFC-125 based on (p,V,T) measurements,
High Temp. - High Pressures, 1994, 26, 193-201. [all data]
Weber, 1999
Weber, F.,
Measurement of the specific enthalpy of vaporization of the alternative refrigerant pentafluoroethane in the temperature range from 175 K to 220 K,
PTB-Mitteilungen, 1999, 109, 6, 469. [all data]
L«65533»ddecke and Magee, 1996
L«65533»ddecke, T.O.; Magee, J.W.,
Molar heat capacity at constant volume of difluoromethane (R32) and pentafluoroethane (R125) from the triple-point temperature to 345 K at pressures to 35 MPa,
Int J Thermophys, 1996, 17, 4, 823-849, https://doi.org/10.1007/BF01439192
. [all data]
Larson and McMahon, 1984
Larson, J.W.; McMahon, T.B.,
Hydrogen bonding in gas phase anions. An experimental investigation of the interaction between chloride ion and bronsted acids from ICR chloride exchange equilibria,
J. Am. Chem. Soc., 1984, 106, 517. [all data]
Larson and McMahon, 1984, 2
Larson, J.W.; McMahon, T.B.,
Gas phase negative ion chemistry of alkylchloroformates,
Can. J. Chem., 1984, 62, 675. [all data]
French, Ikuta, et al., 1982
French, M.A.; Ikuta, S.; Kebarle, P.,
Hydrogen bonding of O-H and C-H hydrogen donors to Cl-. Results from mass spectrometric measurement of the ion-molecule equilibria RH + Cl- = RHCl-,
Can. J. Chem., 1982, 60, 1907. [all data]
Larson and McMahon, 1983
Larson, J.W.; McMahon, T.B.,
Strong hydrogen bonding in gas-phase anions. An ion cyclotron resonance determination of fluoride binding energetics to bronsted acids from gas-phase fluoride exchange equilibria measurements,
J. Am. Chem. Soc., 1983, 105, 2944. [all data]
Arshadi, Yamdagni, et al., 1970
Arshadi, M.; Yamdagni, R.; Kebarle, P.,
Hydration of Halide Negative Ions in the Gas Phase. II. Comparison of Hydration Energies for the Alkali Positive and Halide Negative Ions,
J. Phys. Chem., 1970, 74, 7, 1475, https://doi.org/10.1021/j100702a014
. [all data]
Sullivan and Beauchamp, 1976
Sullivan, S.A.; Beauchamp, J.L.,
Competition between proton transfer and elimination in the reactions of strong bases with fluoroethanes in the gas phase. Influence of base strength on reactivity,
J. Am. Chem. Soc., 1976, 98, 1160. [all data]
Coulson, 1993
Coulson, D.R.,
Kinetics of the fluorination/chlorination of 1-chloro-1,2,2,2-tetrafluoroethane,
J. Catal., 1993, 142, 289-302. [all data]