1-Bromo-2-chloro-1,1,2-trifluoroethane
- Formula: C2HBrClF3
- Molecular weight: 197.382
- IUPAC Standard InChIKey: KFTODZKBBUMDQB-UHFFFAOYSA-N
- CAS Registry Number: 354-06-3
- Chemical structure:
View 3d structure (requires JavaScript / HTML 5) - Other names: Ethane, 1-bromo-2-chloro-1,1,2-trifluoro-; 1,1,2-Trifluoro-1-bromo-2-chloroethane

Gas phase thermochemistry data

Data compiled by: Hussein Y. Afeefy, Joel F. Liebman, and Stephen E. Stein
Quantity | Value | Units | Method | Reference | Comment |
---|---|---|---|---|---|
ΔfH°gas | -654.7 ± 5.6 | kJ/mol | Ccr | Papina, Erastov, et al., 1981 | Reanalyzed by Kolesov and Papina, 1983, Original value = -644.8 ± 6.4 kJ/mol |

Condensed phase thermochemistry data

Data compiled as indicated in comments:
ALS - Hussein Y. Afeefy, Joel F. Liebman, and Stephen E. Stein
DH - Eugene S. Domalski and Elizabeth D. Hearing
Quantity | Value | Units | Method | Reference | Comment |
---|---|---|---|---|---|
ΔfH°liquid | -675.3 ± 6.4 | kJ/mol | Ccr | Papina, Erastov, et al., 1981 | ALS |
Quantity | Value | Units | Method | Reference | Comment |
ΔcH°liquid | -806.3 ± 5.2 | kJ/mol | Ccr | Papina, Erastov, et al., 1981 | ALS |
Constant pressure heat capacity of liquid
Cp,liquid (J/mol*K) | Temperature (K) | Reference | Comment |
---|---|---|---|
160.3 | 298.15 | Vesely, Zabransky, et al., 1988 | T = 298 to 318 K. Cp(J/mol*K) = 115.64 + 0.1501(T/K) (298 to 318 K).; DH |

Phase change data

Data compiled as indicated in comments:
BS - Robert L. Brown and Stephen E. Stein
TRC - Thermodynamics Research Center, NIST Boulder Laboratories, Chris Muzny director
AC - William E. Acree, Jr., James S. Chickos
ALS - Hussein Y. Afeefy, Joel F. Liebman, and Stephen E. Stein
DH - Eugene S. Domalski and Elizabeth D. Hearing
Quantity | Value | Units | Method | Reference | Comment |
---|---|---|---|---|---|
Tboil | 323. to 328. | K | N/A | PCR Inc., 1990 | BS |
Tboil | 325.6 | K | N/A | Majer and Svoboda, 1985 | |
Quantity | Value | Units | Method | Reference | Comment |
Tfus | 146.2 | K | N/A | Golovanova and Kolesov, 1984 | Uncertainty assigned by TRC = 0.2 K; TRC |
Quantity | Value | Units | Method | Reference | Comment |
Tc | 499.8 | K | N/A | Majer and Svoboda, 1985 | |
Quantity | Value | Units | Method | Reference | Comment |
ΔvapH° | 30.12 | kJ/mol | N/A | Majer and Svoboda, 1985 | |
ΔvapH° | 30.0 ± 0.1 | kJ/mol | C | Majer, Svoboda, et al., 1981 | AC |
ΔvapH° | 30.5 | kJ/mol | E | Papina, Erastov, et al., 1981 | ALS |
Enthalpy of vaporization
ΔvapH (kJ/mol) | Temperature (K) | Method | Reference | Comment |
---|---|---|---|---|
28.31 | 325.6 | N/A | Majer and Svoboda, 1985 | |
29.0 ± 0.1 | 313. | C | Majer, Svoboda, et al., 1981 | AC |
28.1 ± 0.1 | 328. | C | Majer, Svoboda, et al., 1981 | AC |
27.2 ± 0.1 | 343. | C | Majer, Svoboda, et al., 1981 | AC |
Enthalpy of vaporization
ΔvapH =
A exp(-βTr) (1 − Tr)β
ΔvapH =
Enthalpy of vaporization (at saturation pressure)
(kJ/mol)
Tr = reduced temperature (T / Tc)
View plot Requires a JavaScript / HTML 5 canvas capable browser.
Temperature (K) | A (kJ/mol) | β | Tc (K) | Reference | Comment |
---|---|---|---|---|---|
298. to 343. | 45.66 | 0.2804 | 499.8 | Majer and Svoboda, 1985 |
Enthalpy of fusion
ΔfusH (kJ/mol) | Temperature (K) | Reference | Comment |
---|---|---|---|
4.380 | 146.2 | Golovanova and Kolesov, 1984, 2 | DH |
4.38 | 146.2 | Domalski and Hearing, 1996 | AC |
Entropy of fusion
ΔfusS (J/mol*K) | Temperature (K) | Reference | Comment |
---|---|---|---|
29.9 | 146.2 | Golovanova and Kolesov, 1984, 2 | DH |

Reaction thermochemistry data

Data compiled by: Hussein Y. Afeefy, Joel F. Liebman, and Stephen E. Stein
Individual Reactions
By formula: HBr + C2ClF3 = C2HBrClF3
Quantity | Value | Units | Method | Reference | Comment |
---|---|---|---|---|---|
ΔrH° | -109.09 ± 0.95 | kJ/mol | Cm | Lacher, Lea, et al., 1950 | gas phase; Heat of hydrobromination at 367°K |

References

Papina, Erastov, et al., 1981
Papina, T.S.; Erastov, P.A.; Kolesov, V.P.,
The enthalpies of formation of 1,1,1-trifluoro-2-chloro-2-bromoethane and 1,1,2-trifluoro-2-chloro-1-bromoethane,
J. Chem. Thermodyn., 1981, 13, 683-689. [all data]
Kolesov and Papina, 1983
Kolesov, V.P.; Papina, T.S.,
Thermochemistry of Haloethanes,
Russ. Chem. Rev., 1983, 52, 425. [all data]
Vesely, Zabransky, et al., 1988
Vesely, F.; Zabransky, M.; Barcal, P.; Svoboda, V.,
Molar heat capacities of four liquid fluorinated and halogenated ethanes,
J. Chem. Thermodynam., 1988, 20, 1283-1285. [all data]
PCR Inc., 1990
PCR Inc.,
Research Chemicals Catalog 1990-1991, PCR Inc., Gainesville, FL, 1990, 1. [all data]
Majer and Svoboda, 1985
Majer, V.; Svoboda, V.,
Enthalpies of Vaporization of Organic Compounds: A Critical Review and Data Compilation, Blackwell Scientific Publications, Oxford, 1985, 300. [all data]
Golovanova and Kolesov, 1984
Golovanova, Y.G.; Kolesov, V.P.,
Enthalpies of melting, melting temperatures, and cryoscopic constants of some haloorganic compounds,
Vestn. Mosk. Univ., Ser. 2: Khim., 1984, 25, 244. [all data]
Majer, Svoboda, et al., 1981
Majer, Vladimír; Svoboda, Václav; Posta, Antonín; Pick, Jirí,
Determination of heats of vaporization and some other thermodynamic quantities for three fluorinated halogen ethanes,
Collect. Czech. Chem. Commun., 1981, 46, 4, 817-822, https://doi.org/10.1135/cccc19810817
. [all data]
Golovanova and Kolesov, 1984, 2
Golovanova, Yu.G.; Kolesov, V.P.,
Enthalpies of melting, melting temperatures, and cryoscopic constants of some haloorganic compounds, Vestn. Mosk Univ.,
Ser. 2: Khim., 1984, 25(3), 244-248. [all data]
Domalski and Hearing, 1996
Domalski, Eugene S.; Hearing, Elizabeth D.,
Heat Capacities and Entropies of Organic Compounds in the Condensed Phase. Volume III,
J. Phys. Chem. Ref. Data, 1996, 25, 1, 1, https://doi.org/10.1063/1.555985
. [all data]
Lacher, Lea, et al., 1950
Lacher, J.R.; Lea, K.R.; Walden, C.H.; Olson, G.G.; Park, J.D.,
Reaction heats of organic fluorine compounds. III. The vapor phase heats of hydrobromination of some simple fluoroolefins,
J. Am. Chem. Soc., 1950, 72, 3231-3234. [all data]