1,2-Dibromo-1,1,2-trifluoroethane
- Formula: C2HBr2F3
- Molecular weight: 241.833
- IUPAC Standard InChIKey: UREJNEBJDURREH-UHFFFAOYSA-N
- CAS Registry Number: 354-04-1
- Chemical structure:
View 3d structure (requires JavaScript / HTML 5) - Other names: Ethane, 1,2-dibromo-1,1,2-trifluoro-

Phase change data

Data compiled as indicated in comments:
BS - Robert L. Brown and Stephen E. Stein
TRC - Thermodynamics Research Center, NIST Boulder Laboratories, Chris Muzny director
Quantity | Value | Units | Method | Reference | Comment |
---|---|---|---|---|---|
Tboil | 349. | K | N/A | PCR Inc., 1990 | BS |
Tboil | 349. | K | N/A | Davis and Larsen, 1967 | Uncertainty assigned by TRC = 2. K; TRC |
Tboil | 349. | K | N/A | Park, Lycan, et al., 1951 | Uncertainty assigned by TRC = 2. K; TRC |

References

PCR Inc., 1990
PCR Inc.,
Research Chemicals Catalog 1990-1991, PCR Inc., Gainesville, FL, 1990, 1. [all data]
Davis and Larsen, 1967
Davis, R.A.; Larsen, E.R.,
Chemistry of Boron Trifluoride. The Fluorination of Bromofluoroethanes,
J. Org. Chem., 1967, 32, 3478. [all data]
Park, Lycan, et al., 1951
Park, J.D.; Lycan, W.R.; Lacher, J.R.,
The Addition Productsw of Trifluoroethylene,
J. Am. Chem. Soc., 1951, 73, 711-2. [all data]