Benzoic acid, 4-(acetyloxy)-3-methoxy-, methyl ester
- Formula: C11H12O5
- Molecular weight: 224.2100
- IUPAC Standard InChIKey: BHQRCCUOSHDJQC-UHFFFAOYSA-N
- CAS Registry Number: 35400-19-2
- Chemical structure:
View 3d structure (requires JavaScript / HTML 5) - Other names: Methyl 3-methoxy-4-acetoxybenzoate; Methyl 4-(acetyloxy)-3-methoxybenzoate

Van Den Dool and Kratz RI, non-polar column, custom temperature program

Column type | Active phase | I | Reference | Comment |
---|---|---|---|---|
Capillary | VF-5MS | 1663.2 | Tret'yakov, 2008 | 30. m/0.25 mm/0.25 μm, He; Program: Multi-step temperature program; T(initial)=60C; T(final)=270C |

References

Tret'yakov, 2008
Tret'yakov, K.V.,
Retention Data. NIST Mass Spectrometry Data Center., NIST Mass Spectrometry Data Center, 2008. [all data]