Butane, 2,2-difluoro
- Formula: C4H8F2
- Molecular weight: 94.1031
- IUPAC Standard InChIKey: IIADOUMJKYSCPM-UHFFFAOYSA-N
- CAS Registry Number: 353-81-1
- Chemical structure:
View 3d structure (requires JavaScript / HTML 5) - Other names: 2,2-Difluorobutane

Phase change data

Data compiled as indicated in comments:
TRC - Thermodynamics Research Center, NIST Boulder Laboratories, Chris Muzny director
AC - William E. Acree, Jr., James S. Chickos
Quantity | Value | Units | Method | Reference | Comment |
---|---|---|---|---|---|
Tboil | 304.0 | K | N/A | Henne, Renoll, et al., 1939 | Uncertainty assigned by TRC = 1. K; TRC |
Enthalpy of vaporization
ΔvapH (kJ/mol) | Temperature (K) | Method | Reference | Comment |
---|---|---|---|---|
30. | 253. | A | Stephenson and Malanowski, 1987 | Based on data from 238. to 336. K. See also Dykyj, 1971.; AC |

Normal alkane RI, non-polar column, temperature ramp

Column type | Active phase | I | Reference | Comment |
---|---|---|---|---|
Capillary | OV-101 | 434. | Zenkevich, 2005 | 25. m/0.20 mm/0.10 μm, N2/He, 6. K/min; Tstart: 50. C; Tend: 250. C |

References

Henne, Renoll, et al., 1939
Henne, A.L.; Renoll, M.W.; Leicester, H.M.,
J. Am. Chem. Soc., 1939, 61, 938. [all data]
Stephenson and Malanowski, 1987
Stephenson, Richard M.; Malanowski, Stanislaw,
Handbook of the Thermodynamics of Organic Compounds, 1987, https://doi.org/10.1007/978-94-009-3173-2
. [all data]
Dykyj, 1971
Dykyj, J.,
Petrochemia, 1971, 11, 2, 27. [all data]
Zenkevich, 2005
Zenkevich, I.G.,
Experimentally measured retention indices., 2005. [all data]