Methane, bromodichlorofluoro-
- Formula: CBrCl2F
- Molecular weight: 181.819
- IUPAC Standard InChIKey: ARBYBCHKMDUXNE-UHFFFAOYSA-N
- CAS Registry Number: 353-58-2
- Chemical structure:
View 3d structure (requires JavaScript / HTML 5) - Other names: Bromodichlorofluoromethane; Fluorodichlorobromomethane

Phase change data

Data compiled by: Robert L. Brown and Stephen E. Stein
Quantity | Value | Units | Method | Reference | Comment |
---|---|---|---|---|---|
Tboil | 325.9 | K | N/A | Buckingham and Donaghy, 1982 |

Vibrational and/or electronic energy levels

Data compiled by: Takehiko Shimanouchi
Symmetry: Cs Symmetry Number σ = 1
Sym. | No | Approximate | Selected Freq. | Infrared | Raman | Comments | ||||
---|---|---|---|---|---|---|---|---|---|---|
Species | type of mode | Value | Rating | Value | Phase | Value | Phase | |||
a' | 1 | CF str | 1080 | C | 1080 VS | gas | 1070 p | liq. | ||
a' | 2 | CCl2 s-str | 796 | C | 796 VS | gas | 783 p | liq. | ||
a' | 3 | CBr str | 502 | C | 502 M | liq. | 504 p | liq. | ||
a' | 4 | CCl2 scis | 339 | D | 339 p | liq. | ||||
a' | 5 | CBrF scis | 306 | D | 306 p | liq. | ||||
a' | 6 | CCl2 wag | 218 | D | 218 p | liq. | ||||
a | 7 | CCl2 a-str | 838 | C | 838 VS | gas | 831 dp | liq. | ||
a | 8 | CCl2 twist | 392 | D | 392 dp | liq. | ||||
a | 9 | CCl2 rock | 204 | D | 204 dp | liq. | ||||
Source: Shimanouchi, 1972

References

Buckingham and Donaghy, 1982
Buckingham, J.; Donaghy, S.M.,
Dictionary of Organic Compounds: Fifth Edition, Chapman and Hall, New York, 1982, 1. [all data]
Shimanouchi, 1972
Shimanouchi, T.,
Tables of Molecular Vibrational Frequencies Consolidated Volume II,
J. Phys. Chem. Ref. Data, 1972, 6, 3, 993-1102. [all data]