2-methyl-2-n-butyltetrahydrofuran
- Formula: C9H18O
- Molecular weight: 142.2386
- IUPAC Standard InChIKey: OYMSVJQGHGHEMZ-UHFFFAOYSA-N
- CAS Registry Number: 35270-62-3
- Chemical structure:
View 3d structure (requires JavaScript / HTML 5) - Permanent link for this species. Use this link for bookmarking this species for future reference.

Phase change data

Data compiled by: Thermodynamics Research Center, NIST Boulder Laboratories, Chris Muzny director
Quantity | Value | Units | Method | Reference | Comment |
---|---|---|---|---|---|
Tboil | 441.65 | K | N/A | Paul and Tchelitcheff, 1950 | Uncertainty assigned by TRC = 1.5 K |

References

Paul and Tchelitcheff, 1950
Paul, R.; Tchelitcheff, S.,
The Methylenyl-2-tetrahydrofuran. Application to the Preparation of beta-Ethylenic Alcohols. Synthesis of Sylvanne,
Bull. Soc. Chim. Fr., 1950, 1950, 520. [all data]